program: Orca
programVersion: 5.0.2
elementType: O O O C C C C C C C C C C C C C C C C C C C C C C H H H H H H H H H H H H H H H H H H H H H H H H H H
charge: 0
multiplicity: 1
keywords: wb97x-d3
keywords: def2-TZVPP
keywords: def2/J RIJCOSX
keywords: DEFGRID2
keywords: scfconv7
keywords: smallprint printgap noloewdin
keywords: NOSOSCF
formula: C22H26O3
InChI: InChI=1/C22H26O3/c1-15(2)10-19-20(22(19,3)4)21(23)25-14-17-12-18(24-13-17)11-16-8-6-5-7-9-16/h5-10,12-13,19-20H,11,14H2,1-4H3
51 atoms
O  -1.675299 2.01544 0.173351
O  -1.690115 0.21308 -1.15265
O  2.401313 1.037548 0.651543
C  -4.472695 -0.244595 0.274046
C  -3.44131 -1.147929 0.878253
C  -3.147371 0.331019 0.748723
C  -4.773705 -0.375492 -1.198027
C  -5.680657 0.139461 1.093218
C  -3.585041 -1.723567 2.235119
C  -2.112023 0.804102 -0.185064
C  -3.710445 -3.021993 2.525205
C  -3.829311 -3.487049 3.944922
C  -3.74778 -4.114266 1.501462
C  -0.658771 2.635244 -0.610772
C  0.7003 2.138793 -0.260277
C  1.928384 2.638606 -0.802074
C  1.04927 1.172307 0.617904
C  2.92565 1.937374 -0.215088
C  4.400664 1.949718 -0.385667
C  4.892504 0.706571 -1.088261
C  4.657277 0.537273 -2.451052
C  5.55694 -0.296648 -0.392053
C  5.080212 -0.610081 -3.104627
C  5.981792 -1.448436 -1.044141
C  5.744344 -1.608486 -2.401628
H  -2.923825 -1.770246 0.154915
H  -3.214381 0.906359 1.665505
H  -3.941407 -0.773455 -1.773749
H  -5.617229 -1.054468 -1.335789
H  -5.05505 0.586714 -1.629745
H  -6.438713 -0.644258 1.041178
H  -5.443171 0.302235 2.143526
H  -6.127884 1.057565 0.708739
H  -3.586483 -1.015787 3.059289
H  -3.781933 -2.661452 4.654534
H  -3.031916 -4.192151 4.193555
H  -4.770776 -4.018239 4.10594
H  -2.899903 -4.791547 1.623395
H  -3.741575 -3.75235 0.47619
H  -4.645045 -4.723058 1.630302
H  -0.739204 3.699986 -0.391077
H  -0.857562 2.51201 -1.677683
H  2.045994 3.420581 -1.535962
H  0.488688 0.522739 1.271802
H  4.892941 2.049016 0.584911
H  4.660354 2.836378 -0.965963
H  4.137991 1.311587 -3.004151
H  5.748105 -0.176631 0.66773
H  4.89319 -0.725428 -4.164507
H  6.498845 -2.220548 -0.489102
H  6.075476 -2.504131 -2.91091
elementType: O C H
totalener: -1079.74035105 hartree
nucrepener: 2043.97826887 hartree
electener: -3123.71861992 hartree
oneelecener: -5527.56360104 hartree
twoeener: 2403.84498112 hartree
cpcmener: -0.03346400 hartree
kineticenergy: 1074.85539662 hartree
xcener: -106.463132816678 hartree
chargesum: 0.0000000
charge: -0.294173 -0.494957 -0.292712 0.137328 0.028328 -0.127368 -0.290780 -0.263530 -0.290169 0.405603 -0.031032 -0.227007 -0.253775 0.107300 -0.034047 -0.350434 -0.056995 0.210409 -0.055652 0.035483 -0.195923 -0.192403 -0.162970 -0.158724 -0.173838 0.095483 0.090021 0.091564 0.096507 0.101881 0.096783 0.089884 0.098618 0.123312 0.089756 0.094648 0.094629 0.098584 0.089996 0.094585 0.127333 0.115733 0.163144 0.171014 0.110182 0.117955 0.145888 0.142790 0.160350 0.159814 0.161581
qa: -0.2942 -0.4950 -0.2927 0.1373 0.0283 -0.1274 -0.2908 -0.2635 -0.2902 0.4056 -0.0310 -0.2270 -0.2538 0.1073 -0.0340 -0.3504 -0.0570 0.2104 -0.0557 0.0355 -0.1959 -0.1924 -0.1630 -0.1587 -0.1738 0.0955 0.0900 0.0916 0.0965 0.1019 0.0968 0.0899 0.0986 0.1233 0.0898 0.0946 0.0946 0.0986 0.0900 0.0946 0.1273 0.1157 0.1631 0.1710 0.1102 0.1180 0.1459 0.1428 0.1604 0.1598 0.1616
va: 2.1211 1.9979 2.2581 3.6833 3.7551 3.8909 3.9031 3.9038 3.8793 4.1463 3.7140 3.9241 3.9456 3.8155 3.6225 4.0069 3.9465 3.6187 3.8149 3.5951 3.9327 3.9452 3.9021 3.8887 3.8922 1.0280 1.0394 1.0187 1.0004 0.9988 1.0028 1.0036 1.0026 1.0076 1.0083 0.9951 0.9964 0.9970 1.0079 0.9979 0.9926 1.0107 1.0052 0.9967 1.0084 1.0067 1.0025 1.0038 0.9902 0.9901 0.9892
dispcorr: -0.021872744 hartree
energy: -1079.762223793309
dipole: -25.84956 25.30893 -0.54062 -14.73584 15.41351 0.67767 7.66337 -7.13743 0.52594
magnitude: 1.01396 au
magnitude: 2.57729 debye
