program: Orca
programVersion: 5.0.2
elementType: O O O C C C C C C C C C C C C C C C C C C C C C C H H H H H H H H H H H H H H H H H H H H H H H H H H
charge: 0
multiplicity: 1
keywords: wb97x-d3
keywords: def2-TZVPP
keywords: def2/J RIJCOSX
keywords: DEFGRID2
keywords: scfconv7
keywords: smallprint printgap noloewdin
keywords: NOSOSCF
formula: C22H26O3
InChI: InChI=1/C22H26O3/c1-15(2)10-19-20(22(19,3)4)21(23)25-14-17-12-18(24-13-17)11-16-8-6-5-7-9-16/h5-10,12-13,19-20H,11,14H2,1-4H3
51 atoms
O  -1.772438 2.1102 0.285168
O  -1.702737 0.38591 -1.137853
O  2.346663 1.241743 0.62045
C  -4.482031 -0.250797 0.223396
C  -3.424519 -1.162938 0.764964
C  -3.181089 0.335323 0.748187
C  -4.765839 -0.288409 -1.258217
C  -5.710915 0.050931 1.047062
C  -3.540429 -1.850295 2.06532
C  -2.157663 0.904069 -0.143916
C  -3.206426 -3.11918 2.324024
C  -3.353242 -3.683885 3.705336
C  -2.65673 -4.082922 1.316189
C  -0.790112 2.812712 -0.472742
C  0.586897 2.304889 -0.221572
C  1.762952 2.704566 -0.934777
C  1.002401 1.418995 0.71086
C  2.799183 2.03264 -0.381488
C  4.25087 1.990706 -0.688962
C  4.697844 0.618869 -1.132942
C  4.275172 0.107547 -2.358244
C  5.51641 -0.162697 -0.325924
C  4.668974 -1.156472 -2.770145
C  5.912608 -1.430352 -0.735565
C  5.4894 -1.930944 -1.958126
H  -2.879649 -1.70155 -0.002757
H  -3.272042 0.843212 1.701867
H  -3.918802 -0.626922 -1.85053
H  -5.590977 -0.976546 -1.450741
H  -5.066998 0.694211 -1.626391
H  -5.494887 0.165005 2.108336
H  -6.175759 0.977615 0.705891
H  -6.448117 -0.747085 0.939695
H  -3.921874 -1.252641 2.888233
H  -3.70806 -2.941617 4.420048
H  -2.400535 -4.076155 4.070521
H  -4.053862 -4.522878 3.713096
H  -3.196853 -5.031373 1.362479
H  -1.611215 -4.314724 1.536581
H  -2.707773 -3.725547 0.289652
H  -0.877442 3.851308 -0.15221
H  -1.025579 2.784761 -1.53893
H  1.821342 3.401276 -1.75642
H  0.494341 0.851158 1.474393
H  4.831299 2.304144 0.182968
H  4.442496 2.723681 -1.474491
H  3.632784 0.705463 -2.994758
H  5.851981 0.224056 0.628982
H  4.3355 -1.539483 -3.725998
H  6.552545 -2.025718 -0.097076
H  5.796349 -2.91806 -2.278359
elementType: O C H
totalener: -1079.74107885 hartree
nucrepener: 2056.70608417 hartree
electener: -3136.44716302 hartree
oneelecener: -5553.13691194 hartree
twoeener: 2416.68974892 hartree
cpcmener: -0.03369227 hartree
kineticenergy: 1074.85074622 hartree
xcener: -106.463185951784 hartree
chargesum: 0.0000000
charge: -0.296845 -0.495305 -0.293380 0.095069 0.050474 -0.089155 -0.276460 -0.271560 -0.290556 0.402108 -0.043846 -0.218884 -0.258474 0.111698 -0.039170 -0.350725 -0.057260 0.204960 -0.046280 0.019358 -0.189479 -0.179872 -0.164690 -0.162349 -0.169995 0.089757 0.088938 0.091150 0.096929 0.100189 0.089538 0.098277 0.097930 0.122041 0.088544 0.093084 0.094774 0.093868 0.100863 0.092320 0.125827 0.116007 0.163989 0.173001 0.108050 0.117884 0.145655 0.142322 0.159953 0.159117 0.160612
qa: -0.2968 -0.4953 -0.2934 0.0951 0.0505 -0.0892 -0.2765 -0.2716 -0.2906 0.4021 -0.0438 -0.2189 -0.2585 0.1117 -0.0392 -0.3507 -0.0573 0.2050 -0.0463 0.0194 -0.1895 -0.1799 -0.1647 -0.1623 -0.1700 0.0898 0.0889 0.0912 0.0969 0.1002 0.0895 0.0983 0.0979 0.1220 0.0885 0.0931 0.0948 0.0939 0.1009 0.0923 0.1258 0.1160 0.1640 0.1730 0.1080 0.1179 0.1457 0.1423 0.1600 0.1591 0.1606
va: 2.1191 1.9978 2.2570 3.7076 3.7632 3.8347 3.9033 3.9103 3.8854 4.1448 3.7537 3.9209 3.9417 3.8069 3.6211 4.0040 3.9484 3.6265 3.8118 3.6102 3.9273 3.9348 3.9014 3.8917 3.8881 1.0332 1.0366 1.0185 0.9999 0.9992 1.0061 1.0014 1.0015 1.0103 1.0089 0.9954 0.9963 0.9978 0.9954 1.0084 0.9921 1.0112 1.0047 0.9974 1.0060 1.0058 1.0028 1.0033 0.9905 0.9904 0.9894
dispcorr: -0.021660590 hartree
energy: -1079.762739443820
dipole: -23.19799 22.71240 -0.48559 -15.53752 16.17141 0.63389 6.80063 -6.30228 0.49835
magnitude: 0.94126 au
magnitude: 2.39249 debye
