program: Orca
programVersion: 5.0.2
elementType: O O O C C C C C C C C C C C C C C C C C C C C C C H H H H H H H H H H H H H H H H H H H H H H H H H H
charge: 0
multiplicity: 1
keywords: wb97x-d3
keywords: def2-TZVPP
keywords: def2/J RIJCOSX
keywords: DEFGRID2
keywords: scfconv7
keywords: smallprint printgap noloewdin
keywords: NOSOSCF
formula: C22H26O3
InChI: InChI=1/C22H26O3/c1-15(2)10-19-20(22(19,3)4)21(23)25-14-17-12-18(24-13-17)11-16-8-6-5-7-9-16/h5-10,12-13,19-20H,11,14H2,1-4H3
51 atoms
O  -1.69169 2.127161 -0.030865
O  -1.185723 1.1589 1.924011
O  2.369313 2.847394 -1.395591
C  -1.653041 -1.34612 0.007665
C  -2.674654 -1.275459 1.107079
C  -2.409376 -0.051304 0.262238
C  -0.194666 -1.451402 0.384811
C  -1.974795 -2.062391 -1.281353
C  -3.996839 -1.924832 1.014614
C  -1.706728 1.112508 0.831672
C  -4.626246 -2.597158 1.983986
C  -5.991028 -3.173806 1.75186
C  -4.080422 -2.832236 3.359936
C  -0.859736 3.266832 0.261692
C  0.544896 2.986348 -0.136721
C  1.540085 2.226295 0.563088
C  1.111522 3.334014 -1.315689
C  2.622332 2.168668 -0.246553
C  3.915888 1.444447 -0.145625
C  3.847613 0.12422 -0.877589
C  4.105283 0.050726 -2.243869
C  3.467791 -1.032665 -0.202554
C  3.982088 -1.154774 -2.922073
C  3.346937 -2.23983 -0.877497
C  3.601017 -2.303706 -2.241176
H  -2.242514 -1.2307 2.100612
H  -3.149119 0.19207 -0.492882
H  0.031723 -1.026096 1.360568
H  0.104014 -2.501213 0.411094
H  0.433383 -0.951928 -0.355812
H  -1.80679 -3.13573 -1.173404
H  -3.004139 -1.915891 -1.605127
H  -1.325274 -1.707461 -2.083605
H  -4.510398 -1.820739 0.062945
H  -6.363967 -2.96115 0.750188
H  -6.710953 -2.774917 2.471364
H  -5.988529 -4.258159 1.88941
H  -3.046307 -2.51678 3.485874
H  -4.134934 -3.893614 3.614691
H  -4.682479 -2.306674 4.106333
H  -0.944532 3.547891 1.311176
H  -1.273299 4.075571 -0.337915
H  1.460808 1.776812 1.539454
H  0.755361 3.909573 -2.156093
H  4.129066 1.273869 0.910056
H  4.72679 2.058999 -0.543174
H  4.406665 0.941096 -2.783013
H  3.260897 -0.987979 0.860495
H  4.18406 -1.196924 -3.984647
H  3.053528 -3.130696 -0.337084
H  3.506145 -3.243468 -2.76943
elementType: O C H
totalener: -1079.74037114 hartree
nucrepener: 2146.98963203 hartree
electener: -3226.73000317 hartree
oneelecener: -5733.52982252 hartree
twoeener: 2506.79981935 hartree
cpcmener: -0.02974615 hartree
kineticenergy: 1074.85499512 hartree
xcener: -106.461573904934 hartree
chargesum: -0.0000000
charge: -0.285501 -0.495708 -0.284136 0.133164 0.035424 -0.099308 -0.303283 -0.276400 -0.285744 0.420564 -0.051092 -0.219341 -0.256008 0.071292 -0.058290 -0.364448 -0.038252 0.230348 -0.042464 0.094774 -0.215039 -0.264005 -0.150765 -0.148066 -0.176575 0.089545 0.093404 0.096954 0.104308 0.096416 0.098057 0.091579 0.097695 0.120092 0.089063 0.092971 0.094048 0.091484 0.094150 0.099322 0.120718 0.120536 0.161414 0.178931 0.109641 0.114872 0.143294 0.145760 0.160245 0.163501 0.160858
qa: -0.2855 -0.4957 -0.2841 0.1332 0.0354 -0.0993 -0.3033 -0.2764 -0.2857 0.4206 -0.0511 -0.2193 -0.2560 0.0713 -0.0583 -0.3644 -0.0383 0.2303 -0.0425 0.0948 -0.2150 -0.2640 -0.1508 -0.1481 -0.1766 0.0895 0.0934 0.0970 0.1043 0.0964 0.0981 0.0916 0.0977 0.1201 0.0891 0.0930 0.0940 0.0915 0.0942 0.0993 0.1207 0.1205 0.1614 0.1789 0.1096 0.1149 0.1433 0.1458 0.1602 0.1635 0.1609
va: 2.1180 2.0049 2.2687 3.6739 3.7837 3.8201 3.9058 3.9005 3.8779 4.1715 3.7605 3.9200 3.9403 3.8418 3.6540 3.9726 3.9688 3.6084 3.8046 3.5222 3.9653 3.9154 3.8899 3.8371 3.8999 1.0334 1.0352 1.0154 1.0019 0.9921 1.0015 1.0062 1.0018 1.0107 1.0088 0.9956 0.9964 1.0092 0.9976 0.9956 1.0081 0.9973 1.0185 0.9925 1.0105 1.0105 1.0087 1.0028 0.9894 0.9879 0.9891
dispcorr: -0.025067835 hartree
energy: -1079.765438973901
dipole: -17.63955 17.46488 -0.17467 -21.73942 21.48261 -0.25681 5.67744 -6.35686 -0.67942
magnitude: 0.74705 au
magnitude: 1.89884 debye
