program: Orca
programVersion: 5.0.2
elementType: O O O C C C C C C C C C C C C C C C C C C C C C C H H H H H H H H H H H H H H H H H H H H H H H H H H
charge: 0
multiplicity: 1
keywords: wb97x-d3
keywords: def2-TZVPP
keywords: def2/J RIJCOSX
keywords: DEFGRID2
keywords: scfconv7
keywords: smallprint printgap noloewdin
keywords: NOSOSCF
formula: C22H26O3
InChI: InChI=1/C22H26O3/c1-15(2)10-19-20(22(19,3)4)21(23)25-14-17-12-18(24-13-17)11-16-8-6-5-7-9-16/h5-10,12-13,19-20H,11,14H2,1-4H3
51 atoms
O  -1.761177 2.372068 0.789885
O  -2.060046 1.602422 -1.289377
O  2.544305 2.496843 0.664301
C  -3.954375 -0.472938 0.130282
C  -2.604971 -1.079001 -0.096467
C  -2.717338 0.27496 0.591826
C  -4.73906 -0.002777 -1.069866
C  -4.836852 -1.00952 1.231893
C  -2.081406 -2.227719 0.667424
C  -2.168665 1.458639 -0.091204
C  -1.436899 -3.283988 0.158877
C  -0.918447 -4.370608 1.052464
C  -1.152481 -3.489931 -1.298724
C  -0.960131 3.473939 0.318357
C  0.450493 3.034441 0.150988
C  1.046832 2.357808 -0.963435
C  1.411572 3.08872 1.102701
C  2.310966 2.0468 -0.597515
C  3.378783 1.2520 -1.251585
C  3.51198 -0.123536 -0.635027
C  4.727847 -0.558608 -0.120314
C  2.412919 -0.979438 -0.574569
C  4.847897 -1.822999 0.445461
C  2.529248 -2.240374 -0.009821
C  3.74887 -2.667097 0.502907
H  -2.267852 -1.011625 -1.124958
H  -2.563291 0.269939 1.665001
H  -4.111284 0.267261 -1.915554
H  -5.405153 -0.801319 -1.401645
H  -5.360685 0.858965 -0.819296
H  -5.583829 -0.266236 1.515863
H  -5.369196 -1.900246 0.892894
H  -4.281581 -1.275248 2.130362
H  -2.220789 -2.191228 1.743987
H  -1.385258 -5.32977 0.81449
H  -1.096561 -4.160018 2.106599
H  0.157165 -4.510225 0.913069
H  -1.692427 -2.810294 -1.954779
H  -1.410081 -4.508535 -1.59654
H  -0.084708 -3.371154 -1.50352
H  -1.040177 4.22762 1.099416
H  -1.374936 3.892282 -0.598291
H  0.59063 2.123586 -1.911547
H  1.431124 3.505025 2.098115
H  4.337195 1.773776 -1.200438
H  3.125564 1.162563 -2.309957
H  5.590048 0.096509 -0.160389
H  1.455604 -0.656813 -0.968377
H  5.801841 -2.145225 0.8426
H  1.666024 -2.893226 0.030958
H  3.83867 -3.650556 0.945582
elementType: O C H
totalener: -1079.73982482 hartree
nucrepener: 2167.84494160 hartree
electener: -3247.58476643 hartree
oneelecener: -5775.10653118 hartree
twoeener: 2527.52176475 hartree
cpcmener: -0.03007717 hartree
kineticenergy: 1074.85208178 hartree
xcener: -106.461082976741 hartree
chargesum: 0.0000000
charge: -0.292445 -0.506925 -0.284189 0.107671 0.043205 -0.088961 -0.276786 -0.271791 -0.277520 0.422001 -0.066189 -0.216599 -0.258713 0.078918 -0.092555 -0.297717 -0.036595 0.197485 -0.045271 0.031713 -0.201577 -0.223159 -0.127888 -0.107395 -0.220390 0.091976 0.088656 0.090580 0.095302 0.099098 0.098021 0.098140 0.089393 0.120881 0.099502 0.090137 0.091257 0.097398 0.100195 0.094394 0.122342 0.118156 0.164124 0.178802 0.104191 0.115886 0.142442 0.148569 0.159374 0.155847 0.157008
qa: -0.2924 -0.5069 -0.2842 0.1077 0.0432 -0.0890 -0.2768 -0.2718 -0.2775 0.4220 -0.0662 -0.2166 -0.2587 0.0789 -0.0926 -0.2977 -0.0366 0.1975 -0.0453 0.0317 -0.2016 -0.2232 -0.1279 -0.1074 -0.2204 0.0920 0.0887 0.0906 0.0953 0.0991 0.0980 0.0981 0.0894 0.1209 0.0995 0.0901 0.0913 0.0974 0.1002 0.0944 0.1223 0.1182 0.1641 0.1788 0.1042 0.1159 0.1424 0.1486 0.1594 0.1558 0.1570
va: 2.1166 1.9876 2.2654 3.6964 3.7531 3.8543 3.8968 3.9122 3.8668 4.1239 3.7496 3.9135 3.9340 3.8342 3.6803 3.9685 3.9668 3.6382 3.8248 3.6645 3.9405 3.9564 3.8677 3.8277 3.9652 1.0331 1.0375 1.0201 1.0000 0.9995 1.0016 1.0012 1.0056 1.0110 0.9965 1.0084 0.9939 1.0067 0.9994 0.9956 0.9971 1.0097 1.0157 0.9931 1.0125 1.0045 1.0030 1.0024 0.9895 0.9870 0.9936
dispcorr: -0.024843305 hartree
energy: -1079.764668129214
dipole: -15.90944 15.89150 -0.01794 -21.18063 20.78725 -0.39338 -0.45644 1.05901 0.60258
magnitude: 0.71984 au
magnitude: 1.82969 debye
