program: Orca
programVersion: 5.0.2
elementType: O O O C C C C C C C C C C C C C C C C C C C C C C H H H H H H H H H H H H H H H H H H H H H H H H H H
charge: 0
multiplicity: 1
keywords: wb97x-d3
keywords: def2-TZVPP
keywords: def2/J RIJCOSX
keywords: DEFGRID2
keywords: scfconv7
keywords: smallprint printgap noloewdin
keywords: NOSOSCF
formula: C22H26O3
InChI: InChI=1/C22H26O3/c1-15(2)10-19-20(22(19,3)4)21(23)25-14-17-12-18(24-13-17)11-16-8-6-5-7-9-16/h5-10,12-13,19-20H,11,14H2,1-4H3
51 atoms
O  -1.674035 2.382342 0.907091
O  -1.977798 1.587724 -1.159804
O  2.177323 2.573592 -1.252376
C  -3.719577 -0.58882 0.274576
C  -2.333851 -1.1174 0.069777
C  -2.534751 0.237382 0.738469
C  -4.521473 -0.178969 -0.936354
C  -4.578981 -1.169611 1.372351
C  -1.757778 -2.228542 0.851331
C  -2.054133 1.441312 0.039826
C  -1.050534 -3.239111 0.334816
C  -0.486746 -4.317787 1.208105
C  -0.758127 -3.371823 -1.135796
C  -0.957946 3.517788 0.389316
C  0.409323 3.105537 -0.020276
C  1.402083 2.508147 0.821743
C  0.936155 3.113268 -1.265354
C  2.448405 2.195252 0.023704
C  3.69651 1.424276 0.263841
C  3.455973 -0.043326 -0.005566
C  2.972213 -0.868404 1.006614
C  3.641399 -0.578672 -1.27662
C  2.681925 -2.201892 0.756273
C  3.350988 -1.913198 -1.530731
C  2.870306 -2.729258 -0.515193
H  -1.985636 -1.047237 -0.955527
H  -2.389958 0.256033 1.812699
H  -5.190005 0.650782 -0.699755
H  -3.905966 0.113788 -1.782677
H  -5.141527 -1.016649 -1.25983
H  -4.019017 -1.38977 2.280385
H  -5.376502 -0.473899 1.638935
H  -5.04776 -2.096585 1.03635
H  -1.916512 -2.205746 1.92521
H  -0.657486 -4.125137 2.267147
H  0.589794 -4.42722 1.052014
H  -0.929581 -5.287232 0.964286
H  -1.629081 -3.16302 -1.757274
H  -0.417774 -4.378594 -1.377712
H  0.032858 -2.68648 -1.449955
H  -0.930855 4.221591 1.21994
H  -1.501638 3.986924 -0.431891
H  1.331386 2.317825 1.881308
H  0.565203 3.461727 -2.216476
H  3.997747 1.567538 1.302147
H  4.506321 1.802215 -0.363458
H  2.816889 -0.461424 1.999048
H  4.017058 0.050602 -2.074721
H  2.308177 -2.830527 1.554399
H  3.502382 -2.316018 -2.523905
H  2.64192 -3.768797 -0.712518
elementType: O C H
totalener: -1079.73854603 hartree
nucrepener: 2202.84784496 hartree
electener: -3282.58639100 hartree
oneelecener: -5845.64669018 hartree
twoeener: 2563.06029918 hartree
cpcmener: -0.03214829 hartree
kineticenergy: 1074.85884563 hartree
xcener: -106.462613663358 hartree
chargesum: 0.0000000
charge: -0.294902 -0.502693 -0.284255 0.114343 0.055416 -0.108859 -0.280774 -0.273385 -0.300756 0.420686 -0.033765 -0.219483 -0.298755 0.104933 -0.074749 -0.358311 -0.029100 0.214262 -0.052227 0.067970 -0.213518 -0.219843 -0.141159 -0.125419 -0.226829 0.095382 0.088801 0.099535 0.090848 0.095111 0.089497 0.098021 0.098351 0.120875 0.090888 0.084635 0.105182 0.110483 0.104741 0.103248 0.122462 0.117000 0.162723 0.178729 0.111215 0.111778 0.144588 0.143434 0.170165 0.160354 0.163127
qa: -0.2949 -0.5027 -0.2843 0.1143 0.0554 -0.1089 -0.2808 -0.2734 -0.3008 0.4207 -0.0338 -0.2195 -0.2988 0.1049 -0.0747 -0.3583 -0.0291 0.2143 -0.0522 0.0680 -0.2135 -0.2198 -0.1412 -0.1254 -0.2268 0.0954 0.0888 0.0995 0.0908 0.0951 0.0895 0.0980 0.0984 0.1209 0.0909 0.0846 0.1052 0.1105 0.1047 0.1032 0.1225 0.1170 0.1627 0.1787 0.1112 0.1118 0.1446 0.1434 0.1702 0.1604 0.1631
va: 2.1124 1.9957 2.2649 3.6872 3.7463 3.8730 3.8989 3.9142 3.8842 4.1257 3.6907 3.9124 3.9388 3.8254 3.6374 3.9920 3.9536 3.6154 3.8244 3.5676 3.9605 3.9710 3.8229 3.8650 3.8659 1.0284 1.0372 0.9992 1.0207 1.0000 1.0056 1.0016 1.0012 1.0104 1.0085 0.9952 0.9954 1.0002 1.0020 0.9932 0.9911 1.0084 1.0094 0.9946 1.0097 1.0137 1.0035 1.0069 0.9798 0.9894 0.9882
dispcorr: -0.026021078 hartree
energy: -1079.764567111669
dipole: -13.76367 13.85720 0.09353 -21.50474 21.12764 -0.37710 3.32620 -2.18680 1.13941
magnitude: 1.20383 au
magnitude: 3.05989 debye
