program: Orca
programVersion: 5.0.2
elementType: O O O C C C C C C C C C C C C C C C C C C C C C C H H H H H H H H H H H H H H H H H H H H H H H H H H
charge: 0
multiplicity: 1
keywords: wb97x-d3
keywords: def2-TZVPP
keywords: def2/J RIJCOSX
keywords: DEFGRID2
keywords: scfconv7
keywords: smallprint printgap noloewdin
keywords: NOSOSCF
formula: C22H26O3
InChI: InChI=1/C22H26O3/c1-15(2)10-19-20(22(19,3)4)21(23)25-14-17-12-18(24-13-17)11-16-8-6-5-7-9-16/h5-10,12-13,19-20H,11,14H2,1-4H3
51 atoms
O  -1.739816 2.426651 0.758354
O  -1.992295 1.607097 -1.308079
O  2.544187 2.536792 0.681762
C  -3.82746 -0.505208 0.148168
C  -2.455877 -1.068856 -0.06104
C  -2.616798 0.292914 0.594652
C  -4.625389 -0.088604 -1.062143
C  -4.686854 -1.053319 1.261819
C  -1.903734 -2.184442 0.735472
C  -2.105461 1.481945 -0.108504
C  -1.415878 -3.331138 0.250364
C  -0.853567 -4.376229 1.16625
C  -1.377195 -3.693325 -1.20279
C  -0.948326 3.531935 0.277941
C  0.4672 3.100434 0.130657
C  1.082349 2.436126 -0.980484
C  1.407981 3.133084 1.103819
C  2.335068 2.10724 -0.590927
C  3.402024 1.296202 -1.227451
C  3.443753 -0.105554 -0.658454
C  4.587711 -0.595552 -0.039564
C  2.321561 -0.92902 -0.742934
C  4.614075 -1.883074 0.485344
C  2.344819 -2.213269 -0.221816
C  3.493003 -2.695051 0.396351
H  -2.119605 -1.018891 -1.091406
H  -2.466555 0.31666 1.668226
H  -5.283489 0.750472 -0.828463
H  -4.00492 0.193708 -1.909323
H  -5.255932 -0.919604 -1.383749
H  -5.191611 -1.966026 0.939425
H  -4.115708 -1.288571 2.159196
H  -5.455919 -0.330854 1.540743
H  -1.890708 -2.043426 1.812523
H  -0.888499 -4.071637 2.212017
H  0.187367 -4.596627 0.913275
H  -1.399146 -5.318443 1.068928
H  -1.933869 -4.617746 -1.376667
H  -0.351077 -3.88948 -1.525071
H  -1.794055 -2.931807 -1.858797
H  -1.044662 4.295558 1.047393
H  -1.358292 3.93235 -0.64888
H  0.643538 2.219883 -1.941027
H  1.407731 3.534926 2.105385
H  4.376744 1.775416 -1.110932
H  3.196146 1.255815 -2.298793
H  5.466945 0.033371 0.034537
H  1.419489 -0.561107 -1.218795
H  5.512511 -2.248887 0.965625
H  1.465004 -2.840387 -0.297465
H  3.510945 -3.696989 0.80514
elementType: O C H
totalener: -1079.73918438 hartree
nucrepener: 2176.79251679 hartree
electener: -3256.53170117 hartree
oneelecener: -5793.09152722 hartree
twoeener: 2536.55982605 hartree
cpcmener: -0.03007122 hartree
kineticenergy: 1074.85405227 hartree
xcener: -106.460984904640 hartree
chargesum: 0.0000000
charge: -0.292688 -0.505102 -0.283020 0.126589 0.033556 -0.103582 -0.281881 -0.267474 -0.272514 0.422764 -0.072801 -0.217874 -0.252879 0.079382 -0.095164 -0.297807 -0.035916 0.198563 -0.046060 0.034229 -0.204994 -0.228232 -0.126580 -0.110236 -0.216906 0.095395 0.088499 0.099541 0.090230 0.095269 0.097771 0.089027 0.098493 0.122233 0.091479 0.087602 0.100031 0.103203 0.094175 0.091492 0.122574 0.117848 0.164035 0.178821 0.104152 0.116776 0.142923 0.147243 0.159742 0.161495 0.156577
qa: -0.2927 -0.5051 -0.2830 0.1266 0.0336 -0.1036 -0.2819 -0.2675 -0.2725 0.4228 -0.0728 -0.2179 -0.2529 0.0794 -0.0952 -0.2978 -0.0359 0.1986 -0.0461 0.0342 -0.2050 -0.2282 -0.1266 -0.1102 -0.2169 0.0954 0.0885 0.0995 0.0902 0.0953 0.0978 0.0890 0.0985 0.1222 0.0915 0.0876 0.1000 0.1032 0.0942 0.0915 0.1226 0.1178 0.1640 0.1788 0.1042 0.1168 0.1429 0.1472 0.1597 0.1615 0.1566
va: 2.1163 1.9892 2.2658 3.6861 3.7474 3.8812 3.8970 3.9088 3.8342 4.1207 3.7557 3.9156 3.9354 3.8353 3.6848 3.9689 3.9656 3.6375 3.8255 3.6528 3.9458 3.9695 3.8669 3.8325 3.9510 1.0298 1.0396 0.9994 1.0199 1.0003 1.0019 1.0046 1.0022 1.0097 1.0080 0.9947 0.9972 0.9977 0.9953 1.0083 0.9969 1.0095 1.0152 0.9928 1.0133 1.0049 1.0030 1.0054 0.9895 0.9807 0.9942
dispcorr: -0.025216229 hartree
energy: -1079.764400608959
dipole: -16.00196 15.94274 -0.05922 -21.92256 21.49689 -0.42567 -0.03890 0.65124 0.61235
magnitude: 0.74811 au
magnitude: 1.90155 debye
