program: Orca
programVersion: 5.0.2
elementType: O O O C C C C C C C C C C C C C C C C C C C C C C H H H H H H H H H H H H H H H H H H H H H H H H H H
charge: 0
multiplicity: 1
keywords: wb97x-d3
keywords: def2-TZVPP
keywords: def2/J RIJCOSX
keywords: DEFGRID2
keywords: scfconv7
keywords: smallprint printgap noloewdin
keywords: NOSOSCF
formula: C22H26O3
InChI: InChI=1/C22H26O3/c1-15(2)10-19-20(22(19,3)4)21(23)25-14-17-12-18(24-13-17)11-16-8-6-5-7-9-16/h5-10,12-13,19-20H,11,14H2,1-4H3
51 atoms
O  -1.725597 2.40486 0.774746
O  -2.004478 1.596068 -1.29233
O  2.560375 2.532394 0.643126
C  -3.854921 -0.492087 0.177179
C  -2.498957 -1.07951 -0.065103
C  -2.620703 0.278156 0.609336
C  -4.666273 -0.040329 -1.011869
C  -4.707194 -1.035783 1.298573
C  -1.951376 -2.210329 0.711712
C  -2.107597 1.467116 -0.092134
C  -1.431944 -3.33669 0.211622
C  -0.881708 -4.395987 1.118827
C  -1.342986 -3.662946 -1.247663
C  -0.941474 3.512821 0.287735
C  0.472576 3.084397 0.120499
C  1.071253 2.409712 -0.993614
C  1.429434 3.131328 1.077007
C  2.331073 2.088627 -0.621614
C  3.387889 1.27065 -1.265661
C  3.448706 -0.118444 -0.668192
C  4.604402 -0.583917 -0.052137
C  2.33249 -0.952833 -0.718928
C  4.649838 -1.859803 0.499184
C  2.373699 -2.224532 -0.168588
C  3.535252 -2.683541 0.442274
H  -2.180528 -1.024788 -1.100676
H  -2.448645 0.286546 1.679779
H  -5.296807 0.81292 -0.754221
H  -4.056376 0.236481 -1.868531
H  -5.325448 -0.84998 -1.33033
H  -5.456139 -0.300895 1.598809
H  -5.23659 -1.933228 0.972742
H  -4.127662 -1.294657 2.183838
H  -1.969481 -2.099664 1.792239
H  -0.955331 -4.119046 2.169946
H  0.17015 -4.5928 0.894894
H  -1.407082 -5.344079 0.980576
H  -0.304998 -3.842792 -1.540182
H  -1.744789 -2.889593 -1.899461
H  -1.885026 -4.587582 -1.461668
H  -1.028307 4.273836 1.061075
H  -1.364993 3.915812 -0.631948
H  0.617972 2.180689 -1.944353
H  1.445968 3.543958 2.073981
H  4.362689 1.756227 -1.180816
H  3.157914 1.207406 -2.33097
H  5.478344 0.054697 -0.002432
H  1.420814 -0.603949 -1.190989
H  5.557569 -2.206555 0.976144
H  1.498563 -2.860918 -0.219011
H  3.567716 -3.67609 0.872474
elementType: O C H
totalener: -1079.73942797 hartree
nucrepener: 2174.93339324 hartree
electener: -3254.67282122 hartree
oneelecener: -5789.36546265 hartree
twoeener: 2534.69264143 hartree
cpcmener: -0.03010725 hartree
kineticenergy: 1074.85207897 hartree
xcener: -106.460716764747 hartree
chargesum: 0.0000000
charge: -0.292429 -0.505591 -0.283562 0.114596 0.039851 -0.094102 -0.278976 -0.268275 -0.271648 0.421179 -0.076223 -0.217839 -0.253017 0.078981 -0.094848 -0.298429 -0.035801 0.198019 -0.046245 0.034104 -0.202631 -0.227462 -0.128115 -0.109313 -0.216709 0.094313 0.088385 0.099576 0.090344 0.095301 0.098280 0.098004 0.088999 0.121563 0.091406 0.088760 0.099799 0.093696 0.092174 0.103075 0.122575 0.118051 0.164100 0.178925 0.104280 0.116946 0.142776 0.147465 0.159657 0.159210 0.156824
qa: -0.2924 -0.5056 -0.2836 0.1146 0.0399 -0.0941 -0.2790 -0.2683 -0.2716 0.4212 -0.0762 -0.2178 -0.2530 0.0790 -0.0948 -0.2984 -0.0358 0.1980 -0.0462 0.0341 -0.2026 -0.2275 -0.1281 -0.1093 -0.2167 0.0943 0.0884 0.0996 0.0903 0.0953 0.0983 0.0980 0.0890 0.1216 0.0914 0.0888 0.0998 0.0937 0.0922 0.1031 0.1226 0.1181 0.1641 0.1789 0.1043 0.1169 0.1428 0.1475 0.1597 0.1592 0.1568
va: 2.1167 1.9884 2.2650 3.6943 3.7487 3.8651 3.8972 3.9097 3.8363 4.1230 3.7608 3.9145 3.9352 3.8353 3.6849 3.9699 3.9655 3.6394 3.8260 3.6514 3.9443 3.9672 3.8681 3.8320 3.9531 1.0311 1.0390 0.9993 1.0200 1.0003 1.0020 1.0016 1.0051 1.0101 1.0080 0.9944 0.9970 0.9952 1.0084 0.9978 0.9970 1.0096 1.0154 0.9928 1.0131 1.0050 1.0029 1.0051 0.9895 0.9824 0.9940
dispcorr: -0.025103567 hartree
energy: -1079.764531541549
dipole: -16.10170 16.04026 -0.06145 -21.73677 21.31821 -0.41857 -0.01058 0.62335 0.61277
magnitude: 0.74462 au
magnitude: 1.89268 debye
