program: Orca
programVersion: 5.0.2
elementType: O O O C C C C C C C C C C C C C C C C C C C C C C H H H H H H H H H H H H H H H H H H H H H H H H H H
charge: 0
multiplicity: 1
keywords: wb97x-d3
keywords: def2-TZVPP
keywords: def2/J RIJCOSX
keywords: DEFGRID2
keywords: scfconv7
keywords: smallprint printgap noloewdin
keywords: NOSOSCF
formula: C22H26O3
InChI: InChI=1/C22H26O3/c1-15(2)10-19-20(22(19,3)4)21(23)25-14-17-12-18(24-13-17)11-16-8-6-5-7-9-16/h5-10,12-13,19-20H,11,14H2,1-4H3
51 atoms
O  -1.675367 2.128243 0.041413
O  -1.121056 1.110485 1.957378
O  2.339818 2.804107 -1.429193
C  -1.702022 -1.372224 0.074644
C  -2.746927 -1.256094 1.147711
C  -2.410939 -0.046497 0.305686
C  -0.258548 -1.534832 0.487155
C  -2.025048 -2.081333 -1.217789
C  -4.091839 -1.851469 1.025962
C  -1.677207 1.094477 0.881492
C  -4.713329 -2.539803 1.987614
C  -6.094017 -3.08276 1.780867
C  -4.086666 -2.814124 3.329789
C  -0.827116 3.255272 0.335307
C  0.564372 2.973482 -0.105693
C  1.590788 2.242736 0.579481
C  1.083122 3.286457 -1.3161
C  2.641842 2.165508 -0.268809
C  3.944781 1.455703 -0.197557
C  3.878756 0.145886 -0.9480
C  4.225365 0.072644 -2.29362
C  3.409757 -1.000363 -0.311457
C  4.106917 -1.123907 -2.989452
C  3.292175 -2.197449 -1.003399
C  3.640092 -2.262337 -2.346626
H  -2.341794 -1.230737 2.154337
H  -3.126914 0.220781 -0.463936
H  0.008444 -2.593426 0.480559
H  0.406357 -1.026244 -0.214332
H  -0.050649 -1.155363 1.485333
H  -1.895497 -3.159359 -1.102925
H  -3.04391 -1.901559 -1.557868
H  -1.350703 -1.752231 -2.010487
H  -4.611398 -1.695555 0.085035
H  -6.113063 -4.168586 1.90509
H  -6.484671 -2.848542 0.790751
H  -6.787694 -2.677695 2.522516
H  -3.156196 -3.377112 3.238318
H  -4.754219 -3.394763 3.965714
H  -3.850055 -1.893648 3.867295
H  -0.880684 3.514968 1.392192
H  -1.251504 4.078837 -0.235547
H  1.550701 1.826594 1.573179
H  0.689929 3.83218 -2.159898
H  4.174893 1.273615 0.852778
H  4.743495 2.083781 -0.598786
H  4.594685 0.955277 -2.802274
H  3.130724 -0.954368 0.735048
H  4.381448 -1.166938 -4.03557
H  2.928023 -3.079848 -0.492907
H  3.549212 -3.19486 -2.888241
elementType: O C H
totalener: -1079.73892623 hartree
nucrepener: 2142.69362259 hartree
electener: -3222.43254882 hartree
oneelecener: -5724.95045327 hartree
twoeener: 2502.51790445 hartree
cpcmener: -0.02952803 hartree
kineticenergy: 1074.85797862 hartree
xcener: -106.461239490276 hartree
chargesum: -0.0000000
charge: -0.285903 -0.498480 -0.283672 0.133438 0.043294 -0.105239 -0.308960 -0.276841 -0.312291 0.420537 -0.014568 -0.223045 -0.284555 0.071599 -0.060270 -0.359069 -0.037161 0.223433 -0.044551 0.094831 -0.212077 -0.264662 -0.151776 -0.148397 -0.177959 0.091715 0.091814 0.103069 0.100910 0.098988 0.097750 0.090918 0.098039 0.120424 0.097374 0.085757 0.097549 0.106000 0.095510 0.101835 0.120197 0.121035 0.161054 0.178784 0.111876 0.113699 0.143030 0.150507 0.159971 0.163612 0.160927
qa: -0.2859 -0.4985 -0.2837 0.1334 0.0433 -0.1052 -0.3090 -0.2768 -0.3123 0.4205 -0.0146 -0.2230 -0.2846 0.0716 -0.0603 -0.3591 -0.0372 0.2234 -0.0446 0.0948 -0.2121 -0.2647 -0.1518 -0.1484 -0.1780 0.0917 0.0918 0.1031 0.1009 0.0990 0.0977 0.0909 0.0980 0.1204 0.0974 0.0858 0.0975 0.1060 0.0955 0.1018 0.1202 0.1210 0.1611 0.1788 0.1119 0.1137 0.1430 0.1505 0.1600 0.1636 0.1609
va: 2.1186 2.0012 2.2687 3.6699 3.7739 3.8496 3.9107 3.9055 3.8917 4.1651 3.6954 3.9185 3.9392 3.8422 3.6486 3.9762 3.9677 3.6148 3.8089 3.5189 3.9653 3.9181 3.8871 3.8509 3.9031 1.0272 1.0361 1.0020 0.9902 1.0167 1.0014 1.0059 1.0018 1.0091 0.9929 1.0101 0.9925 0.9949 1.0047 0.9972 1.0083 0.9972 1.0183 0.9925 1.0097 1.0104 1.0069 0.9994 0.9895 0.9876 0.9892
dispcorr: -0.024873228 hartree
energy: -1079.763799453948
dipole: -17.90274 17.70849 -0.19425 -21.60294 21.35314 -0.24980 5.88454 -6.52982 -0.64528
magnitude: 0.71869 au
magnitude: 1.82678 debye
