program: Orca
programVersion: 5.0.2
elementType: O O O C C C C C C C C C C C C C C C C C C C C C C H H H H H H H H H H H H H H H H H H H H H H H H H H
charge: 0
multiplicity: 1
keywords: wb97x-d3
keywords: def2-TZVPP
keywords: def2/J RIJCOSX
keywords: DEFGRID2
keywords: scfconv7
keywords: smallprint printgap noloewdin
keywords: NOSOSCF
formula: C22H26O3
InChI: InChI=1/C22H26O3/c1-15(2)10-19-20(22(19,3)4)21(23)25-14-17-12-18(24-13-17)11-16-8-6-5-7-9-16/h5-10,12-13,19-20H,11,14H2,1-4H3
51 atoms
O  -1.685205 2.189029 -0.081047
O  -1.242672 1.273472 1.913843
O  2.43453 2.726952 -1.390337
C  -1.77131 -1.251561 0.027949
C  -2.772455 -1.153096 1.14578
C  -2.503661 0.056522 0.283572
C  -0.30905 -1.376378 0.382213
C  -2.126488 -1.976808 -1.246952
C  -4.095287 -1.805008 1.081297
C  -1.758518 1.211283 0.820021
C  -4.685616 -2.512367 2.050718
C  -6.038102 -3.123926 1.835997
C  -4.092487 -2.784076 3.39982
C  -0.813721 3.306203 0.181688
C  0.586705 2.962087 -0.180175
C  1.543388 2.198604 0.56819
C  1.189608 3.25106 -1.356914
C  2.641483 2.081317 -0.213225
C  3.914676 1.332381 -0.056856
C  3.882623 0.049604 -0.854797
C  4.381896 -0.001429 -2.152453
C  3.294206 -1.091248 -0.315385
C  4.294246 -1.170827 -2.897702
C  3.205378 -2.260704 -1.056947
C  3.7047 -2.303066 -2.352659
H  -2.319964 -1.106875 2.13027
H  -3.250916 0.306962 -0.462041
H  -0.062779 -0.94839 1.352077
H  -0.025515 -2.430361 0.411822
H  0.315438 -0.891453 -0.370982
H  -3.158313 -1.815953 -1.555852
H  -1.484174 -1.641566 -2.063351
H  -1.975413 -3.051855 -1.130463
H  -4.635859 -1.689615 0.146027
H  -6.009575 -4.204472 1.998706
H  -6.417424 -2.94435 0.830277
H  -6.765558 -2.725528 2.548026
H  -3.875896 -3.84946 3.513693
H  -4.803829 -2.530594 4.189231
H  -3.171437 -2.23946 3.597067
H  -0.904353 3.629741 1.218356
H  -1.18718 4.106521 -0.454583
H  1.428873 1.787463 1.557848
H  0.869248 3.806226 -2.225094
H  4.046694 1.110885 1.002733
H  4.761505 1.950139 -0.364961
H  4.845265 0.877691 -2.58435
H  2.899094 -1.062862 0.693769
H  4.687013 -1.196457 -3.906043
H  2.745926 -3.139376 -0.622413
H  3.636402 -3.214101 -2.932892
elementType: O C H
totalener: -1079.74067571 hartree
nucrepener: 2142.23983574 hartree
electener: -3221.98051145 hartree
oneelecener: -5723.95575944 hartree
twoeener: 2501.97524798 hartree
cpcmener: -0.02988676 hartree
kineticenergy: 1074.85443338 hartree
xcener: -106.461750733999 hartree
chargesum: 0.0000000
charge: -0.284259 -0.494523 -0.284862 0.138662 0.022944 -0.101015 -0.312741 -0.276421 -0.282276 0.420091 -0.055269 -0.218655 -0.252881 0.069874 -0.057505 -0.363443 -0.035630 0.221927 -0.044614 0.095127 -0.207264 -0.271681 -0.153670 -0.144122 -0.178943 0.093793 0.094909 0.096927 0.106249 0.102788 0.091214 0.098270 0.098038 0.120874 0.092561 0.089067 0.094418 0.099507 0.093714 0.090041 0.121210 0.120328 0.161455 0.178629 0.112994 0.113668 0.142318 0.154973 0.160041 0.162010 0.161154
qa: -0.2843 -0.4945 -0.2849 0.1387 0.0229 -0.1010 -0.3127 -0.2764 -0.2823 0.4201 -0.0553 -0.2187 -0.2529 0.0699 -0.0575 -0.3634 -0.0356 0.2219 -0.0446 0.0951 -0.2073 -0.2717 -0.1537 -0.1441 -0.1789 0.0938 0.0949 0.0969 0.1062 0.1028 0.0912 0.0983 0.0980 0.1209 0.0926 0.0891 0.0944 0.0995 0.0937 0.0900 0.1212 0.1203 0.1615 0.1786 0.1130 0.1137 0.1423 0.1550 0.1600 0.1620 0.1612
va: 2.1181 2.0063 2.2687 3.6713 3.7951 3.8204 3.9118 3.8998 3.8674 4.1785 3.7661 3.9196 3.9394 3.8415 3.6474 3.9786 3.9684 3.6213 3.8093 3.5169 3.9645 3.9243 3.8874 3.8605 3.9070 1.0297 1.0343 1.0148 1.0011 0.9885 1.0063 1.0020 1.0016 1.0102 0.9958 1.0088 0.9963 0.9961 0.9972 1.0108 1.0078 0.9974 1.0186 0.9926 1.0092 1.0096 1.0065 0.9951 0.9895 0.9890 0.9891
dispcorr: -0.025032153 hartree
energy: -1079.765707865289
dipole: -18.03343 17.87773 -0.15571 -21.53833 21.23200 -0.30633 5.92153 -6.60330 -0.68177
magnitude: 0.76347 au
magnitude: 1.94060 debye
