program: Orca
programVersion: 5.0.2
elementType: O O O C C C C C C C C C C C C C C C C C C C C C C H H H H H H H H H H H H H H H H H H H H H H H H H H
charge: 0
multiplicity: 1
keywords: wb97x-d3
keywords: def2-TZVPP
keywords: def2/J RIJCOSX
keywords: DEFGRID2
keywords: scfconv7
keywords: smallprint printgap noloewdin
keywords: NOSOSCF
formula: C22H26O3
InChI: InChI=1/C22H26O3/c1-15(2)10-19-20(22(19,3)4)21(23)25-14-17-12-18(24-13-17)11-16-8-6-5-7-9-16/h5-10,12-13,19-20H,11,14H2,1-4H3
51 atoms
O  -1.41875 0.557436 -0.266136
O  -3.054101 -0.131035 -1.622056
O  2.622966 2.32077 -0.515622
C  -4.801457 0.467678 0.941634
C  -4.616149 -0.998518 0.761281
C  -3.398348 -0.094499 0.74946
C  -5.464815 1.264084 -0.154481
C  -5.089369 1.000679 2.324366
C  -4.824734 -1.965909 1.870255
C  -2.646251 0.094757 -0.502845
C  -4.127505 -3.091042 2.046705
C  -4.42681 -4.02571 3.178783
C  -3.004688 -3.513519 1.150109
C  -0.569598 0.782606 -1.403766
C  0.770866 1.162076 -0.898425
C  1.683118 0.349348 -0.150253
C  1.397688 2.345568 -1.083755
C  2.79006 1.099711 0.055146
C  4.103768 0.813657 0.689117
C  5.168019 0.538995 -0.34763
C  5.531426 -0.769299 -0.652313
C  5.768567 1.583018 -1.047256
C  6.471614 -1.033091 -1.639554
C  6.704934 1.321849 -2.038187
C  7.058363 0.012884 -2.338807
H  -4.887079 -1.365682 -0.225931
H  -2.78286 -0.098089 1.641801
H  -5.340552 0.820598 -1.139373
H  -6.536938 1.327303 0.039538
H  -5.077801 2.283946 -0.189868
H  -6.157736 0.946062 2.542546
H  -4.562355 0.449589 3.103034
H  -4.790907 2.047646 2.400742
H  -5.628265 -1.740174 2.566026
H  -4.695393 -5.017708 2.807349
H  -5.244089 -3.66648 3.803811
H  -3.548371 -4.161806 3.814497
H  -2.836376 -2.83072 0.319325
H  -3.199309 -4.505056 0.734048
H  -2.071859 -3.595859 1.713773
H  -0.983257 1.575624 -2.029886
H  -0.510855 -0.128265 -2.002739
H  1.532573 -0.66689 0.178738
H  1.105726 3.257028 -1.581847
H  3.982282 -0.05556 1.335746
H  4.402095 1.649413 1.327132
H  5.075131 -1.589267 -0.110377
H  5.506668 2.6087 -0.816428
H  6.746347 -2.056512 -1.860299
H  7.159828 2.143057 -2.576967
H  7.787536 -0.189681 -3.112329
elementType: O C H
totalener: -1079.74041790 hartree
nucrepener: 2018.53893868 hartree
electener: -3098.27935657 hartree
oneelecener: -5476.09296591 hartree
twoeener: 2377.81360934 hartree
cpcmener: -0.03026256 hartree
kineticenergy: 1074.85804094 hartree
xcener: -106.459948578740 hartree
chargesum: 0.0000000
charge: -0.283794 -0.510857 -0.286816 0.147968 -0.016921 -0.093537 -0.279378 -0.286149 -0.297164 0.417716 -0.015380 -0.228600 -0.243263 0.089115 -0.083816 -0.324131 -0.030978 0.203290 -0.061292 0.052767 -0.204579 -0.204173 -0.147359 -0.157215 -0.181309 0.100819 0.094760 0.091035 0.096285 0.100605 0.098968 0.093937 0.098121 0.124829 0.096020 0.090450 0.094800 0.082304 0.101744 0.098927 0.115145 0.112714 0.166929 0.179134 0.104688 0.118640 0.142906 0.141729 0.160270 0.159266 0.160828
qa: -0.2838 -0.5109 -0.2868 0.1480 -0.0169 -0.0935 -0.2794 -0.2861 -0.2972 0.4177 -0.0154 -0.2286 -0.2433 0.0891 -0.0838 -0.3241 -0.0310 0.2033 -0.0613 0.0528 -0.2046 -0.2042 -0.1474 -0.1572 -0.1813 0.1008 0.0948 0.0910 0.0963 0.1006 0.0990 0.0939 0.0981 0.1248 0.0960 0.0905 0.0948 0.0823 0.1017 0.0989 0.1151 0.1127 0.1669 0.1791 0.1047 0.1186 0.1429 0.1417 0.1603 0.1593 0.1608
va: 2.1143 1.9873 2.2659 3.6995 3.8079 3.8326 3.8914 3.9110 3.8896 4.0902 3.7077 3.9295 3.9367 3.8419 3.7377 3.9929 3.9448 3.6263 3.8201 3.5949 3.9415 3.9503 3.8788 3.8946 3.8998 1.0274 1.0291 1.0178 1.0011 0.9989 0.9998 1.0016 1.0029 1.0026 0.9961 1.0060 0.9965 1.0134 0.9993 0.9985 1.0010 0.9936 1.0064 0.9932 1.0116 1.0065 1.0033 1.0124 0.9894 0.9904 0.9895
dispcorr: -0.021822951 hartree
energy: -1079.762240846864
dipole: -23.89038 24.30824 0.41787 -11.69894 11.51580 -0.18314 12.40712 -11.28958 1.11754
magnitude: 1.20709 au
magnitude: 3.06817 debye
