program: Orca
programVersion: 5.0.2
elementType: O O O C C C C C C C C C C C C C C C C C C C C C C H H H H H H H H H H H H H H H H H H H H H H H H H H
charge: 0
multiplicity: 1
keywords: wb97x-d3
keywords: def2-TZVPP
keywords: def2/J RIJCOSX
keywords: DEFGRID2
keywords: scfconv7
keywords: smallprint printgap noloewdin
keywords: NOSOSCF
formula: C22H26O3
InChI: InChI=1/C22H26O3/c1-15(2)10-19-20(22(19,3)4)21(23)25-14-17-12-18(24-13-17)11-16-8-6-5-7-9-16/h5-10,12-13,19-20H,11,14H2,1-4H3
51 atoms
O  -1.51353 1.934483 0.454363
O  -0.783473 0.72248 2.191619
O  2.226018 3.270759 -1.321417
C  -1.237712 -1.585218 0.094144
C  -2.29759 -1.629465 1.14097
C  -2.021739 -0.320326 0.430545
C  0.208269 -1.719191 0.509206
C  -1.510689 -2.164759 -1.272702
C  -3.601233 -2.313758 0.941388
C  -1.378488 0.796608 1.138593
C  -4.715466 -2.02377 1.618924
C  -5.989762 -2.777369 1.393004
C  -4.789592 -0.942986 2.65297
C  -0.715203 3.069355 0.83936
C  0.612335 2.976437 0.175606
C  1.66768 2.043166 0.435616
C  1.012701 3.692949 -0.900877
C  2.615537 2.257611 -0.506194
C  3.88276 1.543691 -0.827361
C  3.605135 0.118053 -1.242482
C  2.872054 -0.145918 -2.398934
C  4.034709 -0.950512 -0.463741
C  2.575166 -1.449506 -2.766144
C  3.740935 -2.259141 -0.830924
C  3.009481 -2.512467 -1.981606
H  -1.916529 -1.657108 2.158686
H  -2.737839 -0.021872 -0.326509
H  0.52068 -2.759737 0.403839
H  0.857369 -1.11555 -0.128766
H  0.385678 -1.432735 1.543268
H  -1.340994 -3.243293 -1.275085
H  -2.530808 -1.985182 -1.611264
H  -0.835329 -1.725472 -2.009809
H  -3.634073 -3.116394 0.210171
H  -6.788865 -2.104125 1.072499
H  -6.335993 -3.247589 2.31699
H  -5.88049 -3.556049 0.638574
H  -3.885524 -0.338718 2.712003
H  -4.97086 -1.369187 3.643363
H  -5.628443 -0.273013 2.449799
H  -0.638795 3.139603 1.923989
H  -1.261103 3.94054 0.482174
H  1.711426 1.295048 1.210787
H  0.557202 4.502025 -1.450422
H  4.544753 1.551543 0.040417
H  4.406064 2.075133 -1.625124
H  2.527493 0.676161 -3.015929
H  4.602284 -0.759571 0.439271
H  2.005109 -1.637598 -3.666963
H  4.082926 -3.079585 -0.213301
H  2.777613 -3.530146 -2.267393
elementType: O C H
totalener: -1079.73740766 hartree
nucrepener: 2183.55334758 hartree
electener: -3263.29075524 hartree
oneelecener: -5806.67024966 hartree
twoeener: 2543.37949442 hartree
cpcmener: -0.02808234 hartree
kineticenergy: 1074.85144057 hartree
xcener: -106.461338264194 hartree
chargesum: 0.0000000
charge: -0.290054 -0.500893 -0.281386 0.216180 -0.043778 -0.098938 -0.284768 -0.305498 -0.291371 0.411041 -0.014952 -0.228323 -0.246492 0.075830 -0.085848 -0.332345 -0.034619 0.228433 -0.028064 -0.016191 -0.165718 -0.161110 -0.176191 -0.167027 -0.167527 0.104009 0.092195 0.105139 0.044726 0.104453 0.102062 0.095797 0.096040 0.126085 0.095460 0.095388 0.089818 0.079896 0.102887 0.095215 0.119438 0.119313 0.164776 0.179424 0.103701 0.109717 0.143017 0.142109 0.160125 0.159551 0.159268
qa: -0.2901 -0.5009 -0.2814 0.2162 -0.0438 -0.0989 -0.2848 -0.3055 -0.2914 0.4110 -0.0150 -0.2283 -0.2465 0.0758 -0.0858 -0.3323 -0.0346 0.2284 -0.0281 -0.0162 -0.1657 -0.1611 -0.1762 -0.1670 -0.1675 0.1040 0.0922 0.1051 0.0447 0.1045 0.1021 0.0958 0.0960 0.1261 0.0955 0.0954 0.0898 0.0799 0.1029 0.0952 0.1194 0.1193 0.1648 0.1794 0.1037 0.1097 0.1430 0.1421 0.1601 0.1596 0.1593
va: 2.1095 1.9914 2.2714 3.6206 3.8492 3.8220 3.8891 3.9130 3.8845 4.1357 3.7076 3.9282 3.9421 3.8373 3.7141 3.9495 3.9486 3.6335 3.7923 3.6850 3.8689 3.8768 3.8602 3.8684 3.8365 1.0234 1.0347 1.0012 1.0108 1.0207 0.9983 1.0032 1.0034 1.0027 0.9967 0.9952 1.0066 1.0148 0.9980 0.9994 1.0112 0.9975 1.0134 0.9923 1.0079 1.0139 1.0080 1.0026 0.9910 0.9907 0.9909
dispcorr: -0.026993397 hartree
energy: -1079.764401058560
dipole: -18.08344 17.74126 -0.34218 -18.41072 18.33992 -0.07080 3.23165 -4.02194 -0.79029
magnitude: 0.86409 au
magnitude: 2.19635 debye
