program: Orca
programVersion: 5.0.2
elementType: O O O C C C C C C C C C C C C C C C C C C C C C C H H H H H H H H H H H H H H H H H H H H H H H H H H
charge: 0
multiplicity: 1
keywords: wb97x-d3
keywords: def2-TZVPP
keywords: def2/J RIJCOSX
keywords: DEFGRID2
keywords: scfconv7
keywords: smallprint printgap noloewdin
keywords: NOSOSCF
formula: C22H26O3
InChI: InChI=1/C22H26O3/c1-15(2)10-19-20(22(19,3)4)21(23)25-14-17-12-18(24-13-17)11-16-8-6-5-7-9-16/h5-10,12-13,19-20H,11,14H2,1-4H3
51 atoms
O  -1.13221 1.100471 0.160238
O  -3.201819 1.923027 0.012731
O  3.045398 2.406806 0.225989
C  -3.868667 -0.674325 1.681377
C  -4.27175 -0.849847 0.2592
C  -2.860922 -0.38202 0.577816
C  -4.475035 0.450876 2.482967
C  -3.565369 -1.894377 2.516593
C  -4.495533 -2.180235 -0.360349
C  -2.457259 0.989917 0.226129
C  -4.485208 -2.410621 -1.676056
C  -4.765985 -3.771407 -2.235788
C  -4.202977 -1.348187 -2.693112
C  -0.588977 2.391736 -0.168181
C  0.882848 2.23864 -0.242008
C  1.6297 1.497711 -1.214526
C  1.797034 2.762132 0.605466
C  2.934349 1.632101 -0.884512
C  4.184618 1.071085 -1.455042
C  4.822451 0.065623 -0.525442
C  6.02679 0.340631 0.111693
C  4.191805 -1.151622 -0.276333
C  6.594958 -0.584102 0.980612
C  4.755926 -2.076342 0.589242
C  5.961073 -1.79413 1.222105
H  -4.903832 -0.054511 -0.126819
H  -2.072651 -1.119171 0.475671
H  -4.806771 1.285777 1.870186
H  -5.347016 0.081339 3.025457
H  -3.767954 0.831061 3.222462
H  -4.485392 -2.322368 2.918907
H  -3.052177 -2.673682 1.954255
H  -2.930047 -1.626837 3.362647
H  -4.705249 -3.009829 0.308611
H  -5.606061 -3.740786 -2.934123
H  -5.000528 -4.497121 -1.45747
H  -3.909034 -4.145094 -2.801881
H  -3.893865 -0.400751 -2.253481
H  -5.086417 -1.158807 -3.309191
H  -3.415244 -1.671934 -3.378202
H  -0.865873 3.121637 0.594537
H  -0.994796 2.726738 -1.1249
H  1.238467 0.936757 -2.048973
H  1.71106 3.39183 1.477429
H  4.894412 1.871728 -1.678318
H  3.930725 0.597954 -2.405049
H  6.52779 1.28341 -0.073723
H  3.249666 -1.375399 -0.763973
H  7.53392 -0.356086 1.468626
H  4.255627 -3.018968 0.770475
H  6.402187 -2.514724 1.898399
elementType: O C H
totalener: -1079.74107538 hartree
nucrepener: 2038.74327444 hartree
electener: -3118.48434982 hartree
oneelecener: -5516.58499120 hartree
twoeener: 2398.10064138 hartree
cpcmener: -0.03088886 hartree
kineticenergy: 1074.85914299 hartree
xcener: -106.460170446822 hartree
chargesum: 0.0000000
charge: -0.281290 -0.512428 -0.287274 0.151693 -0.038419 -0.069036 -0.275219 -0.291806 -0.284747 0.409474 -0.013547 -0.228660 -0.248832 0.088220 -0.087350 -0.317701 -0.028441 0.190643 -0.052200 0.022906 -0.186209 -0.190459 -0.159667 -0.165450 -0.172790 0.099848 0.091572 0.090964 0.096804 0.100979 0.100599 0.091853 0.098436 0.126657 0.094724 0.089503 0.096118 0.079964 0.102152 0.095616 0.114270 0.113809 0.166227 0.179773 0.108220 0.118707 0.142972 0.146685 0.160218 0.160417 0.161504
qa: -0.2813 -0.5124 -0.2873 0.1517 -0.0384 -0.0690 -0.2752 -0.2918 -0.2847 0.4095 -0.0135 -0.2287 -0.2488 0.0882 -0.0873 -0.3177 -0.0284 0.1906 -0.0522 0.0229 -0.1862 -0.1905 -0.1597 -0.1654 -0.1728 0.0998 0.0916 0.0910 0.0968 0.1010 0.1006 0.0919 0.0984 0.1267 0.0947 0.0895 0.0961 0.0800 0.1022 0.0956 0.1143 0.1138 0.1662 0.1798 0.1082 0.1187 0.1430 0.1467 0.1602 0.1604 0.1615
va: 2.1175 1.9839 2.2635 3.7168 3.8227 3.8234 3.8840 3.9154 3.8824 4.1012 3.7060 3.9277 3.9438 3.8401 3.7404 3.9873 3.9444 3.6385 3.8175 3.6089 3.9389 3.9280 3.8895 3.9045 3.8905 1.0261 1.0314 1.0180 1.0008 0.9990 0.9988 1.0011 1.0024 1.0025 0.9955 1.0067 0.9963 1.0149 0.9980 0.9987 1.0011 0.9935 1.0063 0.9937 1.0085 1.0059 1.0032 1.0024 0.9899 0.9905 0.9891
dispcorr: -0.021637707 hartree
energy: -1079.762713082290
dipole: -23.49787 24.04473 0.54685 -16.46406 15.55849 -0.90557 -0.91300 0.65251 -0.26049
magnitude: 1.08948 au
magnitude: 2.76923 debye
