program: Orca
programVersion: 5.0.2
elementType: O O O C C C C C C C C C C C C C C C C C C C C C C H H H H H H H H H H H H H H H H H H H H H H H H H H
charge: 0
multiplicity: 1
keywords: wb97x-d3
keywords: def2-TZVPP
keywords: def2/J RIJCOSX
keywords: DEFGRID2
keywords: scfconv7
keywords: smallprint printgap noloewdin
keywords: NOSOSCF
formula: C22H26O3
InChI: InChI=1/C22H26O3/c1-15(2)10-19-20(22(19,3)4)21(23)25-14-17-12-18(24-13-17)11-16-8-6-5-7-9-16/h5-10,12-13,19-20H,11,14H2,1-4H3
51 atoms
O  -1.741172 2.187024 1.037172
O  -2.555513 1.877243 -1.023726
O  1.888249 1.926404 -1.334486
C  -4.143941 -0.51516 0.288412
C  -2.870407 -0.993215 -0.309512
C  -2.847897 0.192012 0.651055
C  -5.165456 0.15682 -0.595345
C  -4.764767 -1.308399 1.413362
C  -2.184843 -2.251149 0.078573
C  -2.405241 1.485936 0.11396
C  -0.857973 -2.406979 0.049242
C  -0.210245 -3.694938 0.453817
C  0.083805 -1.313558 -0.357075
C  -0.924559 3.281787 0.582926
C  0.357408 2.752444 0.04501
C  1.502599 2.345559 0.804602
C  0.651666 2.46587 -1.244987
C  2.402574 1.856176 -0.079062
C  3.751944 1.253376 0.077878
C  3.715405 -0.250919 -0.053694
C  3.496679 -1.045862 1.068263
C  3.85667 -0.865125 -1.294745
C  3.420772 -2.426805 0.954684
C  3.779164 -2.247123 -1.412129
C  3.558815 -3.032049 -0.288048
H  -2.729812 -0.696393 -1.346201
H  -2.47996 -0.023664 1.647203
H  -4.726666 0.65084 -1.458857
H  -5.870775 -0.587761 -0.969004
H  -5.738326 0.898598 -0.035923
H  -5.381362 -2.116758 1.015441
H  -4.020018 -1.752605 2.073757
H  -5.408387 -0.671303 2.022101
H  -2.804803 -3.085818 0.393403
H  -0.940354 -4.44271 0.763181
H  0.485076 -3.538684 1.282766
H  0.37883 -4.113605 -0.366184
H  0.610954 -0.916868 0.514968
H  -0.410076 -0.480362 -0.854147
H  0.851304 -1.6963 -1.033424
H  -0.754361 3.890552 1.468741
H  -1.454781 3.891078 -0.148298
H  1.633539 2.418348 1.873095
H  0.111879 2.598039 -2.16943
H  4.12897 1.531114 1.06266
H  4.438306 1.6783 -0.658898
H  3.383285 -0.578902 2.039749
H  4.033908 -0.260688 -2.176507
H  3.252758 -3.030667 1.83719
H  3.892302 -2.711127 -2.383544
H  3.498307 -4.108825 -0.378872
elementType: O C H
totalener: -1079.73949743 hartree
nucrepener: 2222.91272498 hartree
electener: -3302.65222241 hartree
oneelecener: -5885.42726880 hartree
twoeener: 2582.77504640 hartree
cpcmener: -0.02802153 hartree
kineticenergy: 1074.86199755 hartree
xcener: -106.465200833960 hartree
chargesum: 0.0000000
charge: -0.296531 -0.503151 -0.282486 0.168352 -0.009173 -0.079914 -0.281479 -0.286527 -0.311664 0.372237 0.070408 -0.277938 -0.319464 0.099355 -0.064294 -0.338666 -0.029073 0.196307 -0.049787 0.066608 -0.221597 -0.200675 -0.146420 -0.144079 -0.187183 0.100217 0.089052 0.089303 0.094459 0.100143 0.100107 0.092959 0.097498 0.124870 0.100367 0.100358 0.100642 0.110404 0.089836 0.107690 0.120536 0.117454 0.161054 0.171616 0.112414 0.115290 0.141583 0.140353 0.160087 0.157980 0.160561
qa: -0.2965 -0.5032 -0.2825 0.1684 -0.0092 -0.0799 -0.2815 -0.2865 -0.3117 0.3722 0.0704 -0.2779 -0.3195 0.0994 -0.0643 -0.3387 -0.0291 0.1963 -0.0498 0.0666 -0.2216 -0.2007 -0.1464 -0.1441 -0.1872 0.1002 0.0891 0.0893 0.0945 0.1001 0.1001 0.0930 0.0975 0.1249 0.1004 0.1004 0.1006 0.1104 0.0898 0.1077 0.1205 0.1175 0.1611 0.1716 0.1124 0.1153 0.1416 0.1404 0.1601 0.1580 0.1606
va: 2.0979 1.9866 2.2544 3.6947 3.8070 3.8012 3.8848 3.9090 3.8996 4.1711 3.6183 3.9432 3.9744 3.8071 3.6178 3.9859 3.9128 3.6073 3.8040 3.5396 3.8848 3.9410 3.8138 3.8602 3.8465 1.0287 1.0364 1.0200 1.0008 0.9992 0.9993 1.0010 1.0030 1.0045 1.0102 0.9938 0.9945 0.9895 1.0193 1.0002 0.9940 1.0145 1.0071 1.0039 1.0100 1.0086 1.0040 1.0085 0.9905 0.9904 0.9913
dispcorr: -0.029145756 hartree
energy: -1079.768643183339
dipole: -11.29999 11.96929 0.66930 -16.07494 15.65021 -0.42473 4.15960 -2.95840 1.20120
magnitude: 1.43918 au
magnitude: 3.65810 debye
