program: Orca
programVersion: 5.0.2
elementType: O O O C C C C C C C C C C C C C C C C C C C C C C H H H H H H H H H H H H H H H H H H H H H H H H H H
charge: 0
multiplicity: 1
keywords: wb97x-d3
keywords: def2-TZVPP
keywords: def2/J RIJCOSX
keywords: DEFGRID2
keywords: scfconv7
keywords: smallprint printgap noloewdin
keywords: NOSOSCF
formula: C22H26O3
InChI: InChI=1/C22H26O3/c1-15(2)10-19-20(22(19,3)4)21(23)25-14-17-12-18(24-13-17)11-16-8-6-5-7-9-16/h5-10,12-13,19-20H,11,14H2,1-4H3
51 atoms
O  -2.067188 1.976168 -0.251277
O  -1.911168 1.838783 1.974433
O  2.149319 2.158913 -1.391189
C  -4.062293 -0.359478 -0.100331
C  -2.691418 -0.850053 -0.400009
C  -2.916344 0.051328 0.812192
C  -4.715047 0.626489 -1.037904
C  -5.052842 -1.307694 0.533048
C  -2.235231 -2.24623 -0.198904
C  -2.266948 1.368277 0.913021
C  -0.949743 -2.55031 0.002551
C  -0.478497 -3.96145 0.158944
C  0.104595 -1.481054 0.078826
C  -1.201674 3.124829 -0.30228
C  0.213691 2.69187 -0.443851
C  1.107698 2.197206 0.563318
C  0.906642 2.640539 -1.605302
C  2.266051 1.887243 -0.065068
C  3.549569 1.303759 0.408018
C  3.614345 -0.196735 0.233587
C  3.647311 -0.770027 -1.036857
C  3.628791 -1.03433 1.344781
C  3.683217 -2.148349 -1.190287
C  3.672359 -2.415076 1.194123
C  3.693715 -2.976851 -0.07457
H  -2.203862 -0.337248 -1.225398
H  -2.915605 -0.454984 1.770678
H  -4.003904 1.237651 -1.587705
H  -5.311127 0.08363 -1.774074
H  -5.390919 1.292614 -0.498692
H  -5.553009 -1.906038 -0.23104
H  -4.584088 -1.993288 1.23891
H  -5.82149 -0.752477 1.073403
H  -2.973781 -3.041058 -0.246329
H  -1.291475 -4.681831 0.070463
H  0.001122 -4.106734 1.130467
H  0.277253 -4.205554 -0.592596
H  0.256645 -0.993669 -0.887898
H  1.063607 -1.891016 0.391776
H  -0.164902 -0.695119 0.787386
H  -1.352172 3.762674 0.568079
H  -1.520383 3.678661 -1.183496
H  0.912589 2.08825 1.618217
H  0.654432 2.915092 -2.617984
H  3.665028 1.552014 1.463378
H  4.382363 1.776822 -0.119163
H  3.649014 -0.137153 -1.916096
H  3.605675 -0.60308 2.338597
H  3.705671 -2.577154 -2.183885
H  3.683652 -3.050918 2.070052
H  3.721405 -4.052086 -0.19469
elementType: O C H
totalener: -1079.73560714 hartree
nucrepener: 2219.04946538 hartree
electener: -3298.78507252 hartree
oneelecener: -5877.42461800 hartree
twoeener: 2578.63954548 hartree
cpcmener: -0.02900584 hartree
kineticenergy: 1074.85295986 hartree
xcener: -106.463427361675 hartree
chargesum: -0.0000000
charge: -0.277095 -0.511135 -0.283724 0.162601 0.018487 -0.112999 -0.276257 -0.291343 -0.350303 0.410349 0.045770 -0.232302 -0.268009 0.051345 -0.044639 -0.363247 -0.035248 0.243817 -0.047099 0.019624 -0.211058 -0.178476 -0.140278 -0.126270 -0.192954 0.097858 0.092119 0.093181 0.093817 0.100541 0.100353 0.091975 0.099174 0.125504 0.092949 0.099058 0.097379 0.110823 0.046385 0.103852 0.122257 0.114023 0.160475 0.177751 0.101897 0.115778 0.138044 0.140013 0.159104 0.157299 0.158834
qa: -0.2771 -0.5111 -0.2837 0.1626 0.0185 -0.1130 -0.2763 -0.2913 -0.3503 0.4103 0.0458 -0.2323 -0.2680 0.0513 -0.0446 -0.3632 -0.0352 0.2438 -0.0471 0.0196 -0.2111 -0.1785 -0.1403 -0.1263 -0.1930 0.0979 0.0921 0.0932 0.0938 0.1005 0.1004 0.0920 0.0992 0.1255 0.0929 0.0991 0.0974 0.1108 0.0464 0.1039 0.1223 0.1140 0.1605 0.1778 0.1019 0.1158 0.1380 0.1400 0.1591 0.1573 0.1588
va: 2.0997 1.9819 2.2658 3.7264 3.7606 3.8362 3.8813 3.9119 3.8855 4.1199 3.6810 3.9078 3.9583 3.8567 3.6206 3.9588 3.9608 3.5807 3.8011 3.6237 3.9160 3.8898 3.8585 3.8278 3.8678 1.0276 1.0305 1.0142 1.0006 0.9999 0.9993 1.0017 1.0023 1.0037 1.0098 0.9947 0.9950 0.9926 1.0348 1.0056 1.0087 1.0010 1.0204 0.9933 1.0130 1.0069 1.0174 1.0038 0.9902 0.9913 0.9915
dispcorr: -0.028644658 hartree
energy: -1079.764251795733
dipole: -12.65505 12.76259 0.10754 -16.04830 15.62793 -0.42036 -0.83224 -0.23812 -1.07036
magnitude: 1.15496 au
magnitude: 2.93568 debye
