program: Orca
programVersion: 5.0.2
elementType: O O O C C C C C C C C C C C C C C C C C C C C C C H H H H H H H H H H H H H H H H H H H H H H H H H H
charge: 0
multiplicity: 1
keywords: wb97x-d3
keywords: def2-TZVPP
keywords: def2/J RIJCOSX
keywords: DEFGRID2
keywords: scfconv7
keywords: smallprint printgap noloewdin
keywords: NOSOSCF
formula: C22H26O3
InChI: InChI=1/C22H26O3/c1-15(2)10-19-20(22(19,3)4)21(23)25-14-17-12-18(24-13-17)11-16-8-6-5-7-9-16/h5-10,12-13,19-20H,11,14H2,1-4H3
51 atoms
O  -1.556319 1.894185 0.34505
O  -0.820741 0.654271 2.056162
O  2.375889 2.666926 -1.290416
C  -1.716313 -1.627396 0.047301
C  -2.625693 -1.551721 1.226951
C  -2.324258 -0.288431 0.452052
C  -0.245432 -1.891639 0.257644
C  -2.239025 -2.207992 -1.243948
C  -3.99575 -2.12878 1.202162
C  -1.492965 0.767872 1.054396
C  -5.063899 -1.592747 1.79762
C  -6.407727 -2.25162 1.732101
C  -5.022999 -0.30775 2.565534
C  -0.674768 2.977601 0.699181
C  0.688254 2.74156 0.152396
C  1.774524 2.012695 0.739687
C  1.119492 3.113862 -1.075648
C  2.768866 1.993382 -0.177261
C  4.086306 1.309672 -0.222419
C  3.999366 0.042321 -1.041168
C  4.419905 0.011696 -2.366166
C  3.439661 -1.106075 -0.485956
C  4.287967 -1.146907 -3.12268
C  3.307937 -2.264197 -1.237794
C  3.732331 -2.287432 -2.560878
H  -2.119409 -1.605229 2.188094
H  -3.102415 0.074844 -0.210009
H  0.352553 -1.402271 -0.513373
H  0.118032 -1.560099 1.228069
H  -0.052317 -2.963984 0.188967
H  -2.146221 -3.296005 -1.240052
H  -3.286396 -1.964005 -1.420236
H  -1.663744 -1.832733 -2.09203
H  -4.117102 -3.070721 0.674226
H  -6.779872 -2.483921 2.733081
H  -6.385905 -3.176865 1.156726
H  -7.145777 -1.586559 1.276408
H  -5.393935 -0.458336 3.58243
H  -5.680372 0.436326 2.108138
H  -4.025612 0.122302 2.635771
H  -0.66201 3.1254 1.778844
H  -1.125593 3.857326 0.244155
H  1.808614 1.559921 1.717344
H  0.658278 3.682298 -1.868526
H  4.380489 1.075008 0.801298
H  4.849827 1.974336 -0.632698
H  4.856313 0.89798 -2.81125
H  3.100971 -1.091942 0.543895
H  4.619838 -1.156878 -4.152898
H  2.873029 -3.149001 -0.790487
H  3.630828 -3.19007 -3.149268
elementType: O C H
totalener: -1079.73899499 hartree
nucrepener: 2149.53547856 hartree
electener: -3229.27447355 hartree
oneelecener: -5738.70778250 hartree
twoeener: 2509.43330895 hartree
cpcmener: -0.02846374 hartree
kineticenergy: 1074.85976150 hartree
xcener: -106.461519775285 hartree
chargesum: -0.0000000
charge: -0.289136 -0.503357 -0.283239 0.175187 -0.014438 -0.122490 -0.310147 -0.290524 -0.301111 0.426213 -0.017778 -0.228979 -0.241167 0.074524 -0.074317 -0.336540 -0.035595 0.214067 -0.050473 0.074129 -0.203432 -0.240056 -0.153976 -0.162765 -0.174021 0.103945 0.097431 0.103720 0.094147 0.102214 0.099639 0.094826 0.098811 0.124697 0.096441 0.090004 0.094732 0.101401 0.099530 0.080567 0.120098 0.121520 0.159801 0.178817 0.114885 0.110708 0.142463 0.153105 0.159918 0.164848 0.161153
qa: -0.2891 -0.5034 -0.2832 0.1752 -0.0144 -0.1225 -0.3101 -0.2905 -0.3011 0.4262 -0.0178 -0.2290 -0.2412 0.0745 -0.0743 -0.3365 -0.0356 0.2141 -0.0505 0.0741 -0.2034 -0.2401 -0.1540 -0.1628 -0.1740 0.1039 0.0974 0.1037 0.0941 0.1022 0.0996 0.0948 0.0988 0.1247 0.0964 0.0900 0.0947 0.1014 0.0995 0.0806 0.1201 0.1215 0.1598 0.1788 0.1149 0.1107 0.1425 0.1531 0.1599 0.1648 0.1612
va: 2.1169 1.9929 2.2679 3.6882 3.8183 3.8240 3.8960 3.9019 3.8887 4.1161 3.7105 3.9297 3.9345 3.8387 3.6477 3.9774 3.9665 3.6260 3.8160 3.5471 3.9598 3.9122 3.8879 3.8705 3.8992 1.0254 1.0297 0.9912 1.0160 1.0022 0.9998 1.0020 1.0029 1.0025 0.9960 1.0061 0.9966 0.9996 0.9985 1.0153 1.0081 0.9970 1.0185 0.9924 1.0083 1.0113 1.0048 0.9976 0.9895 0.9867 0.9891
dispcorr: -0.025331734 hartree
energy: -1079.764326720946
dipole: -20.99103 20.47426 -0.51677 -15.88992 15.96924 0.07932 3.56816 -4.19110 -0.62294
magnitude: 0.81326 au
magnitude: 2.06715 debye
