program: Orca
programVersion: 5.0.2
elementType: O O O C C C C C C C C C C C C C C C C C C C C C C H H H H H H H H H H H H H H H H H H H H H H H H H H
charge: 0
multiplicity: 1
keywords: wb97x-d3
keywords: def2-TZVPP
keywords: def2/J RIJCOSX
keywords: DEFGRID2
keywords: scfconv7
keywords: smallprint printgap noloewdin
keywords: NOSOSCF
formula: C22H26O3
InChI: InChI=1/C22H26O3/c1-15(2)10-19-20(22(19,3)4)21(23)25-14-17-12-18(24-13-17)11-16-8-6-5-7-9-16/h5-10,12-13,19-20H,11,14H2,1-4H3
51 atoms
O  -1.907141 2.243549 0.813722
O  -2.012267 1.729398 -1.361461
O  2.333119 2.023043 1.007147
C  -3.678281 -0.762414 -0.447042
C  -2.23318 -1.12318 -0.40457
C  -2.713287 0.143536 0.293179
C  -4.29904 -0.346835 -1.757847
C  -4.636246 -1.513998 0.446752
C  -1.708892 -2.258889 0.396011
C  -2.202534 1.429984 -0.202842
C  -0.64716 -2.207294 1.205254
C  -0.19871 -3.411757 1.974449
C  0.164091 -0.965622 1.430244
C  -1.035707 3.363541 0.56025
C  0.363426 2.873668 0.431453
C  1.04812 2.436275 -0.749519
C  1.197745 2.598217 1.461317
C  2.234012 1.926547 -0.344469
C  3.321981 1.214027 -1.061635
C  3.17862 -0.281641 -0.89628
C  3.970585 -0.986032 0.003322
C  2.203188 -0.970168 -1.614829
C  3.797091 -2.354269 0.178175
C  2.026711 -2.334691 -1.442624
C  2.825751 -3.032695 -0.544105
H  -1.699573 -0.928464 -1.333148
H  -2.768881 0.079213 1.373502
H  -3.583984 0.083275 -2.454798
H  -4.739452 -1.220978 -2.241598
H  -5.100191 0.377862 -1.601986
H  -4.96199 -2.439856 -0.03164
H  -4.19299 -1.77427 1.408131
H  -5.526348 -0.913916 0.64412
H  -2.233678 -3.204969 0.290096
H  -0.850358 -4.270564 1.815311
H  -0.170908 -3.201842 3.046871
H  0.817435 -3.698749 1.690859
H  0.053903 -0.233034 0.63358
H  1.225076 -1.21016 1.514229
H  -0.116818 -0.482985 2.370487
H  -1.149599 4.003887 1.433016
H  -1.360343 3.925008 -0.315732
H  0.69953 2.49122 -1.768174
H  1.120027 2.749088 2.526891
H  4.299119 1.54279 -0.701302
H  3.262809 1.481284 -2.11772
H  4.732366 -0.464039 0.570163
H  1.573563 -0.431203 -2.313825
H  4.423639 -2.889643 0.879949
H  1.266011 -2.854937 -2.010354
H  2.691094 -4.098119 -0.409558
elementType: O C H
totalener: -1079.73782212 hartree
nucrepener: 2268.50974954 hartree
electener: -3348.24757167 hartree
oneelecener: -5976.75735859 hartree
twoeener: 2628.50978692 hartree
cpcmener: -0.02791170 hartree
kineticenergy: 1074.85853130 hartree
xcener: -106.464010990413 hartree
chargesum: 0.0000000
charge: -0.293467 -0.500115 -0.278850 0.159877 0.005780 -0.098452 -0.288222 -0.285515 -0.308485 0.385903 -0.012777 -0.224492 -0.226008 0.079210 -0.075295 -0.290205 -0.049774 0.182268 -0.044240 0.057778 -0.197518 -0.213671 -0.129805 -0.142636 -0.213123 0.100607 0.093289 0.090223 0.094222 0.100104 0.099318 0.092811 0.098490 0.122283 0.090672 0.100968 0.092330 0.031774 0.102368 0.124752 0.123594 0.118018 0.159947 0.177233 0.108838 0.116305 0.141448 0.141982 0.159043 0.158356 0.162859
qa: -0.2935 -0.5001 -0.2788 0.1599 0.0058 -0.0985 -0.2882 -0.2855 -0.3085 0.3859 -0.0128 -0.2245 -0.2260 0.0792 -0.0753 -0.2902 -0.0498 0.1823 -0.0442 0.0578 -0.1975 -0.2137 -0.1298 -0.1426 -0.2131 0.1006 0.0933 0.0902 0.0942 0.1001 0.0993 0.0928 0.0985 0.1223 0.0907 0.1010 0.0923 0.0318 0.1024 0.1248 0.1236 0.1180 0.1599 0.1772 0.1088 0.1163 0.1414 0.1420 0.1590 0.1584 0.1629
va: 2.1009 1.9936 2.2534 3.7087 3.7811 3.8172 3.8842 3.9049 3.8673 4.1575 3.7130 3.9248 3.9162 3.8397 3.6413 3.9591 3.9247 3.6521 3.8085 3.5510 3.9451 3.8721 3.8486 3.8118 3.8570 1.0246 1.0320 1.0208 1.0005 0.9989 1.0005 1.0026 1.0028 1.0049 1.0069 0.9959 0.9965 1.0113 1.0009 1.0036 0.9962 1.0089 1.0158 0.9932 1.0126 1.0084 1.0049 1.0052 0.9897 0.9922 0.9892
dispcorr: -0.030702653 hartree
energy: -1079.768524777318
dipole: -11.41006 11.61611 0.20605 -16.36272 16.01258 -0.35014 2.92472 -2.03067 0.89405
magnitude: 0.98204 au
magnitude: 2.49613 debye
