program: Orca
programVersion: 5.0.2
elementType: O O O C C C C C C C C C C C C C C C C C C C C C C H H H H H H H H H H H H H H H H H H H H H H H H H H
charge: 0
multiplicity: 1
keywords: wb97x-d3
keywords: def2-TZVPP
keywords: def2/J RIJCOSX
keywords: DEFGRID2
keywords: scfconv7
keywords: smallprint printgap noloewdin
keywords: NOSOSCF
formula: C22H26O3
InChI: InChI=1/C22H26O3/c1-15(2)10-19-20(22(19,3)4)21(23)25-14-17-12-18(24-13-17)11-16-8-6-5-7-9-16/h5-10,12-13,19-20H,11,14H2,1-4H3
51 atoms
O  -1.667616 1.889896 0.655617
O  -1.992848 1.745857 -1.552791
O  2.569213 2.45291 0.581185
C  -1.301172 -1.202284 0.1948
C  -2.463313 -0.869572 1.086851
C  -2.344165 -0.183822 -0.247513
C  0.081425 -0.758563 0.608905
C  -1.300229 -2.51023 -0.556416
C  -3.582983 -1.822886 1.298177
C  -1.992746 1.233979 -0.453432
C  -3.681996 -2.670241 2.325762
C  -4.854253 -3.592137 2.464819
C  -2.654247 -2.781294 3.409113
C  -1.009557 3.168926 0.531776
C  0.43219 2.951494 0.243013
C  1.04596 2.646844 -1.015053
C  1.41041 2.820041 1.16949
C  2.33658 2.338893 -0.751507
C  3.416746 1.761229 -1.594227
C  3.305808 0.253633 -1.579673
C  3.848243 -0.491922 -0.536389
C  2.576066 -0.403211 -2.566633
C  3.66013 -1.866752 -0.479529
C  2.387695 -1.777751 -2.512958
C  2.926215 -2.513346 -1.465197
H  -2.198893 -0.265662 1.949374
H  -3.006172 -0.54613 -1.027698
H  0.588688 -1.581274 1.11683
H  0.686468 -0.487489 -0.259235
H  0.073776 0.085112 1.296235
H  -2.289685 -2.788932 -0.917511
H  -0.633554 -2.454781 -1.419715
H  -0.939655 -3.317979 0.084534
H  -4.370598 -1.826307 0.549852
H  -5.568701 -3.475633 1.650118
H  -5.382932 -3.416838 3.405333
H  -4.530236 -4.635833 2.48438
H  -3.092505 -2.555138 4.384466
H  -1.801015 -2.121145 3.262555
H  -2.276036 -3.804409 3.473428
H  -1.146082 3.645628 1.500463
H  -1.500054 3.783931 -0.221765
H  0.580758 2.636262 -1.98699
H  1.423568 2.954249 2.239819
H  4.396855 2.082025 -1.236029
H  3.303924 2.133775 -2.612656
H  4.420753 0.003735 0.238697
H  2.145771 0.168324 -3.380776
H  4.08605 -2.433655 0.338307
H  1.817893 -2.273716 -3.28831
H  2.778337 -3.584415 -1.419245
elementType: O C H
totalener: -1079.73596066 hartree
nucrepener: 2217.23949061 hartree
electener: -3296.97545128 hartree
oneelecener: -5873.87038012 hartree
twoeener: 2576.89492884 hartree
cpcmener: -0.02992014 hartree
kineticenergy: 1074.86362948 hartree
xcener: -106.464122240694 hartree
chargesum: 0.0000000
charge: -0.279638 -0.498152 -0.278786 0.225222 0.010148 -0.140744 -0.328898 -0.297569 -0.289003 0.423067 -0.032360 -0.230910 -0.250909 0.055346 -0.077287 -0.314370 -0.033280 0.203758 -0.042778 0.040758 -0.202980 -0.165192 -0.156250 -0.178909 -0.171038 0.107048 0.094990 0.108392 0.056801 0.102840 0.097082 0.096784 0.098281 0.122918 0.089792 0.094827 0.094374 0.101177 0.087189 0.096614 0.120287 0.121579 0.158855 0.178266 0.111283 0.108743 0.140509 0.141623 0.159373 0.160799 0.160333
qa: -0.2796 -0.4982 -0.2788 0.2252 0.0101 -0.1407 -0.3289 -0.2976 -0.2890 0.4231 -0.0324 -0.2309 -0.2509 0.0553 -0.0773 -0.3144 -0.0333 0.2038 -0.0428 0.0408 -0.2030 -0.1652 -0.1562 -0.1789 -0.1710 0.1070 0.0950 0.1084 0.0568 0.1028 0.0971 0.0968 0.0983 0.1229 0.0898 0.0948 0.0944 0.1012 0.0872 0.0966 0.1203 0.1216 0.1589 0.1783 0.1113 0.1087 0.1405 0.1416 0.1594 0.1608 0.1603
va: 2.1118 1.9929 2.2646 3.5470 3.7810 3.8985 3.9241 3.9092 3.8490 4.1680 3.7036 3.9281 3.9393 3.8548 3.6584 3.9454 3.9354 3.6380 3.8136 3.6044 3.9145 3.8680 3.8685 3.8627 3.8426 1.0168 1.0337 1.0003 1.0100 1.0191 1.0043 1.0043 0.9998 1.0069 1.0074 0.9954 0.9962 0.9983 1.0083 0.9978 0.9993 1.0081 1.0204 0.9933 1.0138 1.0116 1.0094 1.0031 0.9902 0.9906 0.9902
dispcorr: -0.028743254 hartree
energy: -1079.764703917386
dipole: -11.46029 11.91276 0.45247 -22.34231 21.65799 -0.68432 9.56053 -8.39348 1.16705
magnitude: 1.42655 au
magnitude: 3.62600 debye
