program: Orca
programVersion: 5.0.2
elementType: Cl Cl O O O O N C C C C C C C C C C C C C C C C C C C C C C C C C C H H H H H H H H H H H H H H H H H H H H H
charge: 0
multiplicity: 1
keywords: wb97x-d3
keywords: def2-TZVPP
keywords: def2/J RIJCOSX
keywords: DEFGRID2
keywords: scfconv7
keywords: smallprint printgap noloewdin
keywords: NOSOSCF
formula: C26H21Cl2NO4
InChI: InChI=1/C26H21Cl2NO4/c1-2-31-20-13-11-19(12-14-20)25(17-26(25,27)28)24(30)33-23(16-29)18-7-6-10-22(15-18)32-21-8-4-3-5-9-21/h3-15,23H,2,17H2,1H3
54 atoms
Cl -3.82513 -2.796251 1.162796
Cl -5.224194 -0.286544 0.740178
O  -2.126452 1.201268 0.162944
O  -3.343375 1.218548 -1.724975
O  2.443408 -2.71302 -0.330593
O  2.615515 0.847296 -0.959068
N  -2.848238 3.803823 2.113467
C  -2.858121 -0.86254 -0.620885
C  -4.044852 -1.418872 0.118396
C  -3.946342 -1.607289 -1.347092
C  -1.491209 -1.441948 -0.481941
C  -2.838871 0.628187 -0.818164
C  -0.787898 -1.81421 -1.625508
C  -0.844071 -1.506786 0.743362
C  0.524461 -2.233668 -1.549694
C  0.470071 -1.938477 0.836861
C  -1.802476 2.572778 0.058531
C  1.169833 -2.298239 -0.313805
C  -0.297879 2.76046 -0.011242
C  -2.386048 3.250879 1.219457
C  0.519709 1.709921 -0.398169
C  0.253605 4.007915 0.256612
C  3.155412 -2.804648 0.888732
C  1.887484 1.91184 -0.523334
C  1.619605 4.1944 0.126002
C  2.448549 3.155354 -0.266887
C  4.560886 -3.258309 0.577346
C  3.882191 0.639114 -0.50207
C  4.829776 0.219648 -1.424902
C  4.219433 0.779054 0.839189
C  6.121024 -0.056902 -1.003253
C  5.516585 0.504662 1.24591
C  6.472695 0.088122 0.330912
H  -3.711791 -2.602894 -1.700725
H  -4.618202 -1.040114 -1.978238
H  -1.271567 -1.759473 -2.593544
H  -1.360983 -1.206683 1.644796
H  1.068199 -2.50997 -2.443217
H  0.934248 -1.977348 1.812123
H  -2.263211 3.001037 -0.839006
H  0.130193 0.722158 -0.601105
H  -0.372198 4.832794 0.573251
H  3.180639 -1.830542 1.389524
H  2.660937 -3.514681 1.562831
H  2.047839 5.166266 0.331098
H  3.513309 3.316613 -0.371837
H  4.564712 -4.233162 0.090343
H  5.133521 -3.339479 1.500802
H  5.067257 -2.541415 -0.066909
H  4.548111 0.108782 -2.463632
H  3.478644 1.100393 1.560635
H  6.856883 -0.384217 -1.726017
H  5.777891 0.616036 2.290075
H  7.482151 -0.12429 0.655696
totalener: -2279.52957518 hartree
nucrepener: 3751.83409802 hartree
electener: -6031.36367320 hartree
twoeener: 4554.02572126 hartree
kineticenergy: 2272.51113301 hartree
xcener: -173.473747338131 hartree
chargesum: -0.0000000
charge: -0.058564 -0.059581 -0.247084 -0.319885 -0.278144 -0.289889 -0.000023 -0.038059 0.148872 -0.139356 0.060889 0.315274 -0.134327 -0.213431 -0.185388 -0.164841 0.290867 0.281685 -0.005752 -0.250061 -0.059838 -0.156079 -0.007593 0.151765 -0.117680 -0.139249 -0.263924 0.291589 -0.210302 -0.227347 -0.092827 -0.091008 -0.154126 0.097992 0.094012 0.126160 0.128340 0.113190 0.108604 0.132816 0.059339 0.122310 0.089323 0.112749 0.130452 0.134599 0.095251 0.080773 0.087836 0.123298 0.141310 0.127851 0.130630 0.126580
qa: -0.0586 -0.0596 -0.2471 -0.3199 -0.2781 -0.2899 -0.0000 -0.0381 0.1489 -0.1394 0.0609 0.3153 -0.1343 -0.2134 -0.1854 -0.1648 0.2909 0.2817 -0.0058 -0.2501 -0.0598 -0.1561 -0.0076 0.1518 -0.1177 -0.1392 -0.2639 0.2916 -0.2103 -0.2273 -0.0928 -0.0910 -0.1541 0.0980 0.0940 0.1262 0.1283 0.1132 0.1086 0.1328 0.0593 0.1223 0.0893 0.1127 0.1305 0.1346 0.0953 0.0808 0.0878 0.1233 0.1413 0.1279 0.1306 0.1266
va: 1.2487 1.2556 2.1241 2.1878 2.1029 2.0717 3.1101 3.6916 4.2710 4.0094 3.4456 4.2156 3.9584 4.0437 4.0361 3.9034 3.7740 3.8558 3.7760 4.0014 3.8904 3.9969 3.8421 3.9823 3.9905 3.9447 3.9673 3.6434 4.0513 3.9002 3.8811 3.9041 3.9415 1.0277 1.0419 1.0026 1.0269 1.0208 1.0202 1.0268 1.0478 1.0161 0.9759 0.9905 1.0009 1.0028 1.0105 1.0079 1.0070 1.0166 1.0048 0.9996 0.9987 1.0019
dispcorr: -0.035862418 hartree
energy: -2279.565437601376
dipole: 52.59015 -50.24425 2.34590 -3.76740 2.98775 -0.77965 -4.09505 3.56363 -0.53142
magnitude: 2.52853 au
magnitude: 6.42702 debye
