program: Orca
programVersion: 5.0.2
elementType: Cl Cl O O O O N C C C C C C C C C C C C C C C C C C C C C C C C C C H H H H H H H H H H H H H H H H H H H H H
charge: 0
multiplicity: 1
keywords: wb97x-d3
keywords: def2-TZVPP
keywords: def2/J RIJCOSX
keywords: DEFGRID2
keywords: scfconv7
keywords: smallprint printgap noloewdin
keywords: NOSOSCF
formula: C26H21Cl2NO4
InChI: InChI=1/C26H21Cl2NO4/c1-2-31-20-13-11-19(12-14-20)25(17-26(25,27)28)24(30)33-23(16-29)18-7-6-10-22(15-18)32-21-8-4-3-5-9-21/h3-15,23H,2,17H2,1H3
54 atoms
Cl -4.03981 -2.585824 0.994041
Cl -5.345572 -0.148988 0.085129
O  -2.439623 1.334464 0.029695
O  -2.633886 1.101289 -2.197806
O  2.441403 -2.395776 0.581388
O  2.60036 0.834266 -1.271764
N  -2.895417 4.306131 1.476863
C  -2.783818 -0.819321 -0.76964
C  -4.074471 -1.317092 -0.199649
C  -3.720917 -1.642035 -1.605598
C  -1.450588 -1.337202 -0.344034
C  -2.651889 0.640627 -1.09513
C  -0.57663 -1.849192 -1.298884
C  -0.995747 -1.182342 0.957684
C  0.714011 -2.202647 -0.963308
C  0.296164 -1.537865 1.310308
C  -1.716969 2.560384 -0.065676
C  1.164609 -2.044265 0.346652
C  -0.289501 2.279817 0.337904
C  -2.384778 3.527994 0.804259
C  0.562303 1.759761 -0.626104
C  0.143396 2.424877 1.6492
C  2.966594 -2.25348 1.886066
C  1.849221 1.371587 -0.279291
C  1.433139 2.044914 1.981665
C  2.290919 1.513494 1.031782
C  4.415737 -2.678436 1.858927
C  3.963866 0.800579 -1.163871
C  4.701653 1.965209 -0.993237
C  4.596074 -0.426206 -1.288438
C  6.084451 1.890859 -0.939565
C  5.981884 -0.484755 -1.246954
C  6.730017 0.668399 -1.065679
H  -3.433707 -2.663685 -1.818946
H  -4.273792 -1.14732 -2.394156
H  -0.907218 -1.959215 -2.324411
H  -1.649613 -0.770617 1.714239
H  1.389554 -2.593774 -1.712417
H  0.611138 -1.395757 2.334116
H  -1.759048 2.948286 -1.088121
H  0.236867 1.640312 -1.652447
H  -0.512092 2.834767 2.406293
H  2.881758 -1.21249 2.219738
H  2.400195 -2.871804 2.593122
H  1.779473 2.160847 3.000099
H  3.29376 1.220265 1.312757
H  4.838849 -2.607239 2.860767
H  5.002286 -2.038839 1.199881
H  4.518969 -3.71031 1.524536
H  4.200684 2.921426 -0.908282
H  4.005027 -1.32274 -1.414299
H  6.660076 2.79736 -0.807035
H  6.476293 -1.441804 -1.351766
H  7.809694 0.617072 -1.028922
totalener: -2279.52708042 hartree
nucrepener: 3797.03015148 hartree
electener: -6076.55723190 hartree
twoeener: 4599.14806835 hartree
kineticenergy: 2272.52295703 hartree
xcener: -173.472676058950 hartree
chargesum: 0.0000000
charge: -0.061294 -0.061728 -0.235618 -0.314103 -0.290809 -0.287341 -0.001326 0.028687 0.155968 -0.149341 0.073907 0.265901 -0.165468 -0.230584 -0.178792 -0.142291 0.280375 0.269364 0.053534 -0.255786 -0.231763 -0.162899 0.016383 0.309534 -0.106966 -0.242683 -0.254712 0.273246 -0.169710 -0.244787 -0.113196 -0.111908 -0.129044 0.096200 0.091899 0.127658 0.128000 0.114631 0.106694 0.134507 0.125153 0.122793 0.075677 0.104490 0.130736 0.136689 0.084033 0.083736 0.090022 0.134282 0.134321 0.129652 0.135441 0.128636
qa: -0.0613 -0.0617 -0.2356 -0.3141 -0.2908 -0.2873 -0.0013 0.0287 0.1560 -0.1493 0.0739 0.2659 -0.1655 -0.2306 -0.1788 -0.1423 0.2804 0.2694 0.0535 -0.2558 -0.2318 -0.1629 0.0164 0.3095 -0.1070 -0.2427 -0.2547 0.2732 -0.1697 -0.2448 -0.1132 -0.1119 -0.1290 0.0962 0.0919 0.1277 0.1280 0.1146 0.1067 0.1345 0.1252 0.1228 0.0757 0.1045 0.1307 0.1367 0.0840 0.0837 0.0900 0.1343 0.1343 0.1297 0.1354 0.1286
va: 1.2471 1.2542 2.1115 2.1848 2.0902 2.0842 3.1119 3.6301 4.2748 3.9994 3.4660 4.2765 4.0387 4.0767 3.9989 3.8534 3.8436 3.8658 3.6795 4.0353 4.0187 4.0041 3.8372 3.6824 3.9522 3.9350 3.9726 3.7487 3.9740 3.9777 3.9399 3.9030 3.9530 1.0268 1.0399 1.0038 1.0267 1.0158 1.0182 1.0226 1.0297 1.0200 0.9830 0.9916 1.0000 1.0012 1.0096 1.0057 1.0064 1.0037 1.0201 0.9992 0.9966 0.9990
dispcorr: -0.038198977 hartree
energy: -2279.565279394769
dipole: 53.54841 -51.09013 2.45827 -4.81004 3.65338 -1.15666 3.01668 -2.86453 0.15215
magnitude: 2.72105 au
magnitude: 6.91636 debye
