program: Orca
programVersion: 5.0.2
elementType: Cl Cl O O O O N C C C C C C C C C C C C C C C C C C C C C C C C C C H H H H H H H H H H H H H H H H H H H H H
charge: 0
multiplicity: 1
keywords: wb97x-d3
keywords: def2-TZVPP
keywords: def2/J RIJCOSX
keywords: DEFGRID2
keywords: scfconv7
keywords: smallprint printgap noloewdin
keywords: NOSOSCF
formula: C26H21Cl2NO4
InChI: InChI=1/C26H21Cl2NO4/c1-2-31-20-13-11-19(12-14-20)25(17-26(25,27)28)24(30)33-23(16-29)18-7-6-10-22(15-18)32-21-8-4-3-5-9-21/h3-15,23H,2,17H2,1H3
54 atoms
Cl -3.62365 -2.9813 0.301952
Cl -5.087005 -0.499594 -0.09799
O  -2.272705 1.168427 0.384162
O  -2.56894 1.461066 -1.817473
O  2.781846 -2.454117 0.366335
O  2.746647 1.41465 0.814634
N  -2.357799 3.087006 3.075567
C  -2.430793 -0.761295 -0.907553
C  -3.707024 -1.471461 -0.562312
C  -3.257634 -1.421586 -1.975203
C  -1.094236 -1.302658 -0.525757
C  -2.45456 0.741343 -0.871166
C  -0.159808 -1.600737 -1.513078
C  -0.712265 -1.427447 0.802578
C  1.119848 -2.000334 -1.186068
C  0.57129 -1.82181 1.146873
C  -1.960717 2.544484 0.551293
C  1.507505 -2.100733 0.151196
C  -0.526669 2.82599 0.168585
C  -2.189857 2.830812 1.968971
C  0.476964 1.991245 0.645266
C  -0.21716 3.886631 -0.666491
C  3.309241 -2.468338 1.678764
C  1.791194 2.229858 0.286631
C  1.107055 4.124211 -1.008728
C  2.115775 3.302489 -0.537647
C  2.99537 -3.750436 2.426653
C  3.679708 0.841276 0.00058
C  3.422266 0.50732 -1.322655
C  4.90844 0.54661 0.575329
C  4.40721 -0.128168 -2.062864
C  5.879462 -0.095824 -0.175776
C  5.636072 -0.434367 -1.498809
H  -2.878922 -2.339785 -2.40529
H  -3.807386 -0.788303 -2.659661
H  -0.434119 -1.50561 -2.556775
H  -1.420531 -1.210062 1.591368
H  1.84355 -2.223211 -1.958659
H  0.821124 -1.90256 2.195419
H  -2.637288 3.172436 -0.037496
H  0.252955 1.150132 1.288479
H  -1.001336 4.52295 -1.055503
H  4.386427 -2.366933 1.547519
H  2.978231 -1.586895 2.238359
H  1.355032 4.955458 -1.654711
H  3.146943 3.49129 -0.807126
H  3.48025 -3.735094 3.403243
H  3.368649 -4.616937 1.881583
H  1.927293 -3.892852 2.589286
H  2.460793 0.722215 -1.769622
H  5.092798 0.819569 1.606278
H  4.204543 -0.391251 -3.092896
H  6.836297 -0.323227 0.275688
H  6.396694 -0.932163 -2.084439
totalener: -2279.52679769 hartree
nucrepener: 3815.15615755 hartree
electener: -6094.68295523 hartree
twoeener: 4617.53220768 hartree
kineticenergy: 2272.52774930 hartree
xcener: -173.474017238132 hartree
chargesum: -0.0000000
charge: -0.057728 -0.067019 -0.242304 -0.314230 -0.279895 -0.302772 0.003534 0.046633 0.157786 -0.156764 0.098560 0.251303 -0.140142 -0.309560 -0.249601 -0.130104 0.284938 0.299351 0.071215 -0.250427 -0.235021 -0.132298 0.019661 0.195201 -0.097897 -0.151981 -0.248249 0.306197 -0.164955 -0.281518 -0.123679 -0.096568 -0.124026 0.096931 0.092557 0.126581 0.142958 0.121561 0.118997 0.124926 0.145029 0.111024 0.097930 0.077890 0.130012 0.135410 0.085172 0.090032 0.085630 0.131365 0.127710 0.127039 0.128253 0.125356
qa: -0.0577 -0.0670 -0.2423 -0.3142 -0.2799 -0.3028 0.0035 0.0466 0.1578 -0.1568 0.0986 0.2513 -0.1401 -0.3096 -0.2496 -0.1301 0.2849 0.2994 0.0712 -0.2504 -0.2350 -0.1323 0.0197 0.1952 -0.0979 -0.1520 -0.2482 0.3062 -0.1650 -0.2815 -0.1237 -0.0966 -0.1240 0.0969 0.0926 0.1266 0.1430 0.1216 0.1190 0.1249 0.1450 0.1110 0.0979 0.0779 0.1300 0.1354 0.0852 0.0900 0.0856 0.1314 0.1277 0.1270 0.1283 0.1254
va: 1.2510 1.2492 2.1296 2.1893 2.1052 2.0724 3.1169 3.6336 4.2765 4.0127 3.3606 4.2662 4.0095 4.0588 4.0106 3.8469 3.8662 3.8278 3.6448 4.0276 4.0510 4.0179 3.8660 3.9186 3.9500 3.9815 3.9522 3.6434 3.8794 3.9995 3.9594 3.9068 3.9623 1.0274 1.0402 1.0022 1.0190 1.0162 1.0096 1.0181 1.0178 1.0124 0.9932 0.9946 1.0005 1.0027 1.0094 1.0055 1.0055 1.0085 1.0147 0.9989 0.9969 0.9987
dispcorr: -0.037640954 hartree
energy: -2279.564438640466
dipole: 45.92982 -44.25158 1.67823 -3.83072 3.28772 -0.54301 -1.34496 0.22849 -1.11647
magnitude: 2.08754 au
magnitude: 5.30611 debye
