program: Orca
programVersion: 5.0.2
elementType: Cl Cl O O O O N C C C C C C C C C C C C C C C C C C C C C C C C C C H H H H H H H H H H H H H H H H H H H H H
charge: 0
multiplicity: 1
keywords: wb97x-d3
keywords: def2-TZVPP
keywords: def2/J RIJCOSX
keywords: DEFGRID2
keywords: scfconv7
keywords: smallprint printgap noloewdin
keywords: NOSOSCF
formula: C26H21Cl2NO4
InChI: InChI=1/C26H21Cl2NO4/c1-2-31-20-13-11-19(12-14-20)25(17-26(25,27)28)24(30)33-23(16-29)18-7-6-10-22(15-18)32-21-8-4-3-5-9-21/h3-15,23H,2,17H2,1H3
54 atoms
Cl -3.743614 -2.895479 0.472599
Cl -5.180037 -0.399578 0.071114
O  -2.376434 1.237991 0.384074
O  -2.602446 1.466474 -1.830314
O  2.632284 -2.594034 0.236439
O  2.646264 1.273777 0.819166
N  -2.306665 3.195622 3.035674
C  -2.567169 -0.727492 -0.854985
C  -3.835423 -1.407234 -0.43388
C  -3.452145 -1.401692 -1.865681
C  -1.2214 -1.282468 -0.52113
C  -2.545281 0.773689 -0.85424
C  -0.339502 -1.61457 -1.546475
C  -0.784373 -1.391932 0.792448
C  0.941151 -2.05115 -1.268401
C  0.499094 -1.827802 1.087744
C  -1.990989 2.605535 0.511218
C  1.374332 -2.161523 0.054919
C  -0.551607 2.797884 0.096491
C  -2.18044 2.922199 1.927403
C  0.421756 1.96277 0.632059
C  -0.214574 3.762185 -0.84057
C  3.137426 -2.717571 1.560759
C  1.738703 2.097567 0.224047
C  1.112958 3.901045 -1.222848
C  2.095142 3.076864 -0.69791
C  4.538286 -3.269156 1.478791
C  3.716649 0.777853 0.126329
C  3.627365 0.371392 -1.199454
C  4.899584 0.626067 0.836411
C  4.739092 -0.192029 -1.809065
C  6.000497 0.055335 0.214696
C  5.927689 -0.352905 -1.110007
H  -3.10253 -2.333191 -2.29286
H  -4.031257 -0.784577 -2.541746
H  -0.655117 -1.528573 -2.579176
H  -1.442882 -1.131974 1.611311
H  1.616489 -2.308477 -2.074831
H  0.795815 -1.898623 2.124979
H  -2.650479 3.261373 -0.065853
H  0.170303 1.207989 1.367319
H  -0.977254 4.400235 -1.268131
H  3.133818 -1.741057 2.056896
H  2.501435 -3.390007 2.146297
H  1.388167 4.659523 -1.943623
H  3.125548 3.203978 -1.004752
H  4.949598 -3.356841 2.484606
H  5.196046 -2.615556 0.905318
H  4.551847 -4.26124 1.025973
H  2.703446 0.477283 -1.753769
H  4.952589 0.945363 1.869859
H  4.668575 -0.513037 -2.840391
H  6.920238 -0.066592 0.772325
H  6.788717 -0.796398 -1.592471
elementType: Cl O N C H
totalener: -2279.55965253 hartree
nucrepener: 3801.16982162 hartree
electener: -6080.72947415 hartree
twoeener: 4604.33294913 hartree
cpcmener: -0.03560480 hartree
kineticenergy: 2272.44648487 hartree
xcener: -173.461990984013 hartree
chargesum: -0.0000000
charge: -0.073883 -0.084616 -0.253720 -0.384541 -0.316126 -0.327152 -0.082767 0.076058 0.147172 -0.131403 0.080487 0.287199 -0.163665 -0.286320 -0.266155 -0.184170 0.388460 0.312182 0.052606 -0.223770 -0.297154 -0.193610 0.018190 0.273335 -0.116804 -0.199303 -0.271072 0.365335 -0.236416 -0.283069 -0.128002 -0.129417 -0.176842 0.109290 0.099117 0.149100 0.153359 0.139224 0.140879 0.142483 0.157281 0.147070 0.100077 0.117652 0.160101 0.157148 0.093265 0.082087 0.093863 0.153205 0.142941 0.157513 0.157190 0.156107
qa: -0.0739 -0.0846 -0.2537 -0.3845 -0.3161 -0.3272 -0.0828 0.0761 0.1472 -0.1314 0.0805 0.2872 -0.1637 -0.2863 -0.2662 -0.1842 0.3885 0.3122 0.0526 -0.2238 -0.2972 -0.1936 0.0182 0.2733 -0.1168 -0.1993 -0.2711 0.3653 -0.2364 -0.2831 -0.1280 -0.1294 -0.1768 0.1093 0.0991 0.1491 0.1534 0.1392 0.1409 0.1425 0.1573 0.1471 0.1001 0.1177 0.1601 0.1571 0.0933 0.0821 0.0939 0.1532 0.1429 0.1575 0.1572 0.1561
va: 1.2329 1.2314 2.1442 2.1231 2.0628 2.0458 3.1096 3.5976 4.2823 3.9919 3.3147 4.2460 4.0079 3.9836 3.9632 3.8417 3.7602 3.7528 3.6059 4.0809 4.0445 3.9793 3.8036 3.7952 3.8940 3.9359 3.9623 3.5006 3.8864 3.9779 3.8945 3.8354 3.8774 1.0255 1.0377 0.9973 1.0159 1.0120 1.0106 1.0141 1.0098 1.0028 0.9789 0.9902 0.9898 0.9953 1.0070 1.0077 1.0053 0.9997 1.0100 0.9905 0.9900 0.9906
dispcorr: -0.037486337 hartree
energy: -2279.597138862535
dipole: 50.12006 -48.13765 1.98241 -3.77465 3.21911 -0.55554 -3.93710 2.45285 -1.48425
magnitude: 2.53803 au
magnitude: 6.45115 debye
