program: Orca
programVersion: 5.0.2
elementType: Cl Cl O O O O N C C C C C C C C C C C C C C C C C C C C C C C C C C H H H H H H H H H H H H H H H H H H H H H
charge: 0
multiplicity: 1
keywords: wb97x-d3
keywords: def2-TZVPP
keywords: def2/J RIJCOSX
keywords: DEFGRID2
keywords: scfconv7
keywords: smallprint printgap noloewdin
keywords: NOSOSCF
formula: C26H21Cl2NO4
InChI: InChI=1/C26H21Cl2NO4/c1-2-31-20-13-11-19(12-14-20)25(17-26(25,27)28)24(30)33-23(16-29)18-7-6-10-22(15-18)32-21-8-4-3-5-9-21/h3-15,23H,2,17H2,1H3
54 atoms
Cl -3.540477 -2.864786 0.38903
Cl -4.79666 -0.317134 -0.224813
O  -2.043266 1.162924 0.314082
O  -1.988301 1.361911 -1.913495
O  2.714425 -3.188768 0.729308
O  2.926603 1.987121 0.712154
N  -2.725943 3.071345 2.911678
C  -2.130581 -0.817565 -0.903662
C  -3.470739 -1.412244 -0.574177
C  -2.965709 -1.477357 -1.965759
C  -0.863898 -1.454093 -0.430825
C  -2.057559 0.682153 -0.930102
C  0.003428 -2.045209 -1.345908
C  -0.503174 -1.442599 0.911203
C  1.190087 -2.619128 -0.933417
C  0.692597 -2.001381 1.338803
C  -1.93322 2.56775 0.473394
C  1.548487 -2.601661 0.415625
C  -0.521575 3.077017 0.284799
C  -2.383345 2.829577 1.842447
C  0.566113 2.265263 0.572535
C  -0.330115 4.387013 -0.135828
C  3.173863 -3.151093 2.074489
C  1.845619 2.775266 0.416105
C  0.956105 4.887852 -0.26188
C  2.053516 4.081845 0.004827
C  4.49425 -3.877375 2.136588
C  3.314072 1.031228 -0.183014
C  2.811658 0.943283 -1.475646
C  4.284072 0.136669 0.258757
C  3.293139 -0.046251 -2.3236
C  4.753999 -0.841802 -0.601916
C  4.261893 -0.94151 -1.897469
H  -2.639091 -2.441193 -2.3354
H  -3.449672 -0.854183 -2.70772
H  -0.251115 -2.064301 -2.398372
H  -1.157177 -0.998896 1.650624
H  1.849671 -3.083753 -1.655197
H  0.931174 -1.968657 2.392916
H  -2.615861 3.094414 -0.202623
H  0.438853 1.244748 0.91362
H  -1.182771 5.015273 -0.361453
H  3.288984 -2.11293 2.404261
H  2.446459 -3.631495 2.73744
H  1.107056 5.909169 -0.585194
H  3.060749 4.463245 -0.105848
H  5.243947 -3.406724 1.499529
H  4.392038 -4.921283 1.837873
H  4.868512 -3.859614 3.160174
H  2.059053 1.631777 -1.836936
H  4.671802 0.217086 1.266838
H  2.898005 -0.110788 -3.329375
H  5.511563 -1.532431 -0.254252
H  4.629422 -1.70952 -2.565112
elementType: Cl O N C H
totalener: -2279.55967923 hartree
nucrepener: 3804.98066693 hartree
electener: -6084.54034616 hartree
twoeener: 4607.99241025 hartree
cpcmener: -0.03743552 hartree
kineticenergy: 2272.43895259 hartree
xcener: -173.459720231898 hartree
chargesum: 0.0000000
charge: -0.073710 -0.085303 -0.257946 -0.385686 -0.318202 -0.327646 -0.081319 0.088004 0.141301 -0.129618 0.053646 0.315377 -0.169685 -0.297067 -0.251085 -0.140087 0.354905 0.284597 -0.009132 -0.220725 -0.131771 -0.167226 0.018145 0.149870 -0.138005 -0.150300 -0.264150 0.319354 -0.190267 -0.241255 -0.172553 -0.130863 -0.193309 0.108105 0.100252 0.143750 0.151621 0.136857 0.141829 0.150131 0.171035 0.145231 0.103027 0.113983 0.160125 0.150539 0.084222 0.089421 0.090892 0.143956 0.142052 0.157307 0.162648 0.154726
qa: -0.0737 -0.0853 -0.2579 -0.3857 -0.3182 -0.3276 -0.0813 0.0880 0.1413 -0.1296 0.0536 0.3154 -0.1697 -0.2971 -0.2511 -0.1401 0.3549 0.2846 -0.0091 -0.2207 -0.1318 -0.1672 0.0181 0.1499 -0.1380 -0.1503 -0.2642 0.3194 -0.1903 -0.2413 -0.1726 -0.1309 -0.1933 0.1081 0.1003 0.1438 0.1516 0.1369 0.1418 0.1501 0.1710 0.1452 0.1030 0.1140 0.1601 0.1505 0.0842 0.0894 0.0909 0.1440 0.1421 0.1573 0.1626 0.1547
va: 1.2343 1.2323 2.1278 2.1211 2.0612 2.0780 3.1105 3.5891 4.2825 3.9917 3.3448 4.1774 3.9928 4.0263 3.9639 3.7993 3.7493 3.7914 3.6698 4.0644 3.9417 3.9529 3.8039 3.8496 3.8895 3.9657 3.9683 3.6434 3.8139 3.9282 3.8754 3.8373 3.8523 1.0262 1.0371 1.0008 1.0184 1.0142 1.0097 1.0159 0.9986 1.0002 0.9832 0.9897 0.9892 1.0001 1.0046 1.0036 1.0066 1.0079 1.0108 0.9912 0.9806 0.9920
dispcorr: -0.036830036 hartree
energy: -2279.596509269588
dipole: 45.29456 -43.81289 1.48167 -6.10598 5.67692 -0.42905 -0.82023 -0.33644 -1.15667
magnitude: 1.92804 au
magnitude: 4.90068 debye
