program: Orca
programVersion: 5.0.2
elementType: Cl Cl O O O O N C C C C C C C C C C C C C C C C C C C C C C C C C C H H H H H H H H H H H H H H H H H H H H H
charge: 0
multiplicity: 1
keywords: wb97x-d3
keywords: def2-TZVPP
keywords: def2/J RIJCOSX
keywords: DEFGRID2
keywords: scfconv7
keywords: smallprint printgap noloewdin
keywords: NOSOSCF
formula: C26H21Cl2NO4
InChI: InChI=1/C26H21Cl2NO4/c1-2-31-20-13-11-19(12-14-20)25(17-26(25,27)28)24(30)33-23(16-29)18-7-6-10-22(15-18)32-21-8-4-3-5-9-21/h3-15,23H,2,17H2,1H3
54 atoms
Cl -3.577923 -3.096379 -0.327688
Cl -4.993356 -0.575275 -0.479331
O  -1.685335 1.026436 0.673008
O  -2.748563 1.603438 -1.201283
O  2.535693 -3.140574 1.047727
O  2.658715 2.413912 -1.587817
N  -0.815045 2.387298 3.539397
C  -2.193429 -0.706692 -0.806235
C  -3.519804 -1.437427 -0.87246
C  -2.807317 -1.122384 -2.122703
C  -0.977608 -1.402819 -0.293479
C  -2.261974 0.761963 -0.500061
C  0.119207 -1.592329 -1.129058
C  -0.878542 -1.809228 1.030918
C  1.28134 -2.174584 -0.65842
C  0.279082 -2.396134 1.518764
C  -1.525805 2.390017 1.0252
C  1.372557 -2.582112 0.673058
C  -0.45855 3.087657 0.208666
C  -1.131733 2.368022 2.435929
C  0.625213 2.371351 -0.283965
C  -0.566417 4.454208 -0.003752
C  2.716917 -3.526405 2.404982
C  1.607045 3.045417 -0.997858
C  0.427827 5.112712 -0.71165
C  1.517216 4.416292 -1.206731
C  4.114347 -4.074726 2.550526
C  3.292765 1.341968 -1.024495
C  3.861614 0.438329 -1.912944
C  3.4489 1.178462 0.346793
C  4.599614 -0.629302 -1.425485
C  4.176899 0.094352 0.819199
C  4.757278 -0.81041 -0.058563
H  -2.337318 -1.942176 -2.650909
H  -3.219551 -0.350215 -2.759955
H  0.071281 -1.27733 -2.164524
H  -1.712133 -1.669595 1.707662
H  2.125808 -2.317202 -1.320671
H  0.309054 -2.700668 2.555884
H  -2.473486 2.934355 0.952483
H  0.702638 1.30222 -0.126034
H  -1.419952 5.000221 0.378121
H  2.573435 -2.664405 3.065109
H  1.9787 -4.285693 2.684003
H  0.353141 6.178337 -0.88281
H  2.291263 4.927159 -1.765186
H  4.274576 -4.941708 1.908855
H  4.273086 -4.39002 3.581922
H  4.867231 -3.322195 2.312973
H  3.736464 0.581261 -2.979084
H  3.023679 1.884539 1.048675
H  5.046997 -1.326393 -2.122309
H  4.296795 -0.033312 1.887552
H  5.331381 -1.646138 0.318778
elementType: Cl O N C H
totalener: -2279.55912138 hartree
nucrepener: 3770.84236118 hartree
electener: -6050.40148256 hartree
twoeener: 4573.99511631 hartree
cpcmener: -0.03656015 hartree
kineticenergy: 2272.43445109 hartree
xcener: -173.461205580556 hartree
chargesum: -0.0000000
charge: -0.073205 -0.078826 -0.256739 -0.393133 -0.320467 -0.319873 -0.082348 0.070522 0.132459 -0.119343 0.024523 0.327335 -0.154623 -0.233445 -0.290500 -0.186819 0.372819 0.320946 0.035545 -0.224707 -0.210370 -0.226338 0.041193 0.308428 -0.095079 -0.253056 -0.273178 0.315765 -0.252869 -0.192616 -0.134962 -0.156563 -0.190306 0.111924 0.099152 0.145125 0.145657 0.146817 0.140911 0.149974 0.133626 0.144612 0.098515 0.105032 0.159142 0.146721 0.089492 0.093326 0.083473 0.142750 0.156561 0.156473 0.156105 0.164441
qa: -0.0732 -0.0788 -0.2567 -0.3931 -0.3205 -0.3199 -0.0823 0.0705 0.1325 -0.1193 0.0245 0.3273 -0.1546 -0.2334 -0.2905 -0.1868 0.3728 0.3209 0.0355 -0.2247 -0.2104 -0.2263 0.0412 0.3084 -0.0951 -0.2531 -0.2732 0.3158 -0.2529 -0.1926 -0.1350 -0.1566 -0.1903 0.1119 0.0992 0.1451 0.1457 0.1468 0.1409 0.1500 0.1336 0.1446 0.0985 0.1050 0.1591 0.1467 0.0895 0.0933 0.0835 0.1427 0.1566 0.1565 0.1561 0.1644
va: 1.2291 1.2344 2.1364 2.1191 2.0741 2.1011 3.1083 3.5990 4.2740 3.9842 3.3805 4.1788 3.9163 3.9850 3.9832 3.8903 3.7382 3.7814 3.6311 4.0650 3.9714 4.0038 3.8007 3.7081 3.8794 4.0067 3.9749 3.6457 3.9790 3.8817 3.8641 3.8420 3.8380 1.0267 1.0430 1.0006 1.0160 1.0094 1.0092 1.0121 1.0184 1.0023 0.9856 0.9872 0.9886 1.0068 1.0027 1.0072 1.0016 1.0098 0.9970 0.9906 0.9916 0.9824
dispcorr: -0.035117851 hartree
energy: -2279.594239226869
dipole: 43.70901 -42.69562 1.01340 -4.65206 4.21156 -0.44050 6.45391 -6.97478 -0.52087
magnitude: 1.22160 au
magnitude: 3.10507 debye
