program: Orca
programVersion: 5.0.2
elementType: Cl Cl O O O O N C C C C C C C C C C C C C C C C C C C C C C C C C C H H H H H H H H H H H H H H H H H H H H H
charge: 0
multiplicity: 1
keywords: wb97x-d3
keywords: def2-TZVPP
keywords: def2/J RIJCOSX
keywords: DEFGRID2
keywords: scfconv7
keywords: smallprint printgap noloewdin
keywords: NOSOSCF
formula: C26H21Cl2NO4
InChI: InChI=1/C26H21Cl2NO4/c1-2-31-20-13-11-19(12-14-20)25(17-26(25,27)28)24(30)33-23(16-29)18-7-6-10-22(15-18)32-21-8-4-3-5-9-21/h3-15,23H,2,17H2,1H3
54 atoms
Cl -3.851784 -2.847862 0.456873
Cl -5.22092 -0.309626 0.085137
O  -2.39271 1.23442 0.375912
O  -2.573299 1.489016 -1.840228
O  2.560393 -2.655001 0.09574
O  2.629759 1.107121 0.810984
N  -2.260213 3.147577 3.054656
C  -2.63264 -0.712309 -0.882439
C  -3.913957 -1.353999 -0.4434
C  -3.554565 -1.352474 -1.881977
C  -1.296679 -1.306879 -0.576975
C  -2.558888 0.787032 -0.869216
C  -0.447071 -1.665573 -1.620493
C  -0.830502 -1.417916 0.726672
C  0.833409 -2.119786 -1.37028
C  0.45292 -1.871782 0.993885
C  -1.960682 2.58606 0.521698
C  1.299829 -2.220199 -0.057423
C  -0.517002 2.736577 0.105685
C  -2.137058 2.887594 1.942987
C  0.433877 1.880199 0.646171
C  -0.158714 3.679881 -0.845312
C  3.117994 -2.724991 1.403438
C  1.751778 1.966204 0.224027
C  1.169145 3.774399 -1.236343
C  2.12986 2.925022 -0.710514
C  4.54792 -3.186951 1.276574
C  3.770819 0.716969 0.159185
C  3.742111 0.243747 -1.1466
C  4.954918 0.742012 0.88067
C  4.919197 -0.202502 -1.728674
C  6.124067 0.284407 0.288061
C  6.112595 -0.184757 -1.017906
H  -3.241157 -2.291824 -2.319915
H  -4.125904 -0.71378 -2.544556
H  -0.786488 -1.583714 -2.645964
H  -1.464261 -1.141434 1.559494
H  1.483646 -2.394492 -2.191575
H  0.774161 -1.940895 2.024038
H  -2.598828 3.271896 -0.044529
H  0.163809 1.143734 1.393439
H  -0.905934 4.333509 -1.276484
H  3.073505 -1.74327 1.886515
H  2.544542 -3.425007 2.0204
H  1.462779 4.515777 -1.967526
H  3.160024 3.018216 -1.028977
H  4.994002 -3.254397 2.269067
H  5.145783 -2.489464 0.688922
H  4.611106 -4.17364 0.815999
H  2.814564 0.215116 -1.704951
H  4.959192 1.111152 1.898715
H  4.898295 -0.573747 -2.74521
H  7.047233 0.300593 0.852976
H  7.025462 -0.53932 -1.478345
elementType: Cl O N C H
totalener: -2279.55956783 hartree
nucrepener: 3798.28147145 hartree
electener: -6077.84103928 hartree
twoeener: 4601.43004737 hartree
cpcmener: -0.03520810 hartree
kineticenergy: 2272.44361568 hartree
xcener: -173.461119349097 hartree
chargesum: 0.0000000
charge: -0.074364 -0.084292 -0.253120 -0.384443 -0.317151 -0.325565 -0.082604 0.075379 0.147779 -0.130663 0.074627 0.288724 -0.158512 -0.279026 -0.267085 -0.193575 0.389223 0.312515 0.055740 -0.225408 -0.307353 -0.197066 0.022176 0.286016 -0.119111 -0.204708 -0.269825 0.331123 -0.218906 -0.263125 -0.136219 -0.122270 -0.169373 0.109339 0.099635 0.148739 0.153608 0.138873 0.141374 0.142336 0.153451 0.146486 0.098255 0.120437 0.159653 0.153970 0.094555 0.073921 0.094757 0.159374 0.143820 0.157046 0.154966 0.155871
qa: -0.0744 -0.0843 -0.2531 -0.3844 -0.3172 -0.3256 -0.0826 0.0754 0.1478 -0.1307 0.0746 0.2887 -0.1585 -0.2790 -0.2671 -0.1936 0.3892 0.3125 0.0557 -0.2254 -0.3074 -0.1971 0.0222 0.2860 -0.1191 -0.2047 -0.2698 0.3311 -0.2189 -0.2631 -0.1362 -0.1223 -0.1694 0.1093 0.0996 0.1487 0.1536 0.1389 0.1414 0.1423 0.1535 0.1465 0.0983 0.1204 0.1597 0.1540 0.0946 0.0739 0.0948 0.1594 0.1438 0.1570 0.1550 0.1559
va: 1.2325 1.2316 2.1451 2.1239 2.0633 2.0378 3.1102 3.5977 4.2846 3.9900 3.3279 4.2448 4.0067 3.9786 3.9760 3.8370 3.7631 3.7463 3.6023 4.0812 4.0476 3.9798 3.8005 3.7944 3.9018 3.9297 3.9609 3.5037 3.8925 4.0066 3.9013 3.8498 3.8729 1.0254 1.0372 0.9973 1.0159 1.0121 1.0109 1.0135 1.0119 1.0033 0.9806 0.9904 0.9901 0.9976 1.0065 1.0082 1.0067 0.9947 1.0091 0.9912 0.9911 0.9912
dispcorr: -0.037531289 hartree
energy: -2279.597099122900
dipole: 50.80331 -48.69945 2.10386 -3.61054 3.08458 -0.52596 -4.47490 2.97372 -1.50118
magnitude: 2.63750 au
magnitude: 6.70400 debye
