program: Orca
programVersion: 5.0.2
elementType: Cl Cl O O O O N C C C C C C C C C C C C C C C C C C C C C C C C C C H H H H H H H H H H H H H H H H H H H H H
charge: 0
multiplicity: 1
keywords: wb97x-d3
keywords: def2-TZVPP
keywords: def2/J RIJCOSX
keywords: DEFGRID2
keywords: scfconv7
keywords: smallprint printgap noloewdin
keywords: NOSOSCF
formula: C26H21Cl2NO4
InChI: InChI=1/C26H21Cl2NO4/c1-2-31-20-13-11-19(12-14-20)25(17-26(25,27)28)24(30)33-23(16-29)18-7-6-10-22(15-18)32-21-8-4-3-5-9-21/h3-15,23H,2,17H2,1H3
54 atoms
Cl -3.783781 -3.011116 -0.163693
Cl -5.108565 -0.455643 -0.563087
O  -2.241763 1.09415 0.518488
O  -2.408182 1.568618 -1.658184
O  2.57679 -2.545281 1.068453
O  2.800208 1.10541 0.566401
N  -2.069497 2.711668 3.387655
C  -2.354896 -0.726211 -0.936925
C  -3.682685 -1.42612 -0.885683
C  -2.995638 -1.264867 -2.186392
C  -1.109291 -1.333265 -0.383469
C  -2.361698 0.767061 -0.769018
C  -0.001049 -1.489751 -1.210632
C  -0.97426 -1.623683 0.968366
C  1.213578 -1.908899 -0.701726
C  0.237744 -2.045734 1.493346
C  -1.860194 2.436528 0.799562
C  1.351612 -2.171155 0.662122
C  -0.440733 2.709029 0.356701
C  -1.984286 2.573256 2.251158
C  0.556354 1.784466 0.648663
C  -0.147479 3.857186 -0.361618
C  2.839656 -2.755427 2.451954
C  1.851086 2.023399 0.219919
C  1.159393 4.091978 -0.767697
C  2.164761 3.184121 -0.479651
C  2.993212 -1.466646 3.231524
C  3.706388 0.660336 -0.355457
C  3.423265 0.572099 -1.713256
C  4.931952 0.232443 0.138454
C  4.384366 0.058027 -2.573182
C  5.877714 -0.287856 -0.732045
C  5.611975 -0.374658 -2.091895
H  -2.554964 -2.148982 -2.629618
H  -3.413152 -0.563351 -2.898075
H  -0.081546 -1.271319 -2.268796
H  -1.815859 -1.510566 1.639434
H  2.067232 -2.023457 -1.357393
H  0.293947 -2.257136 2.552333
H  -2.549082 3.152812 0.340392
H  0.341155 0.879377 1.20522
H  -0.930342 4.564527 -0.603742
H  2.076111 -3.400831 2.896235
H  3.775534 -3.313957 2.473469
H  1.397109 4.991266 -1.320264
H  3.180715 3.379708 -0.798676
H  3.80973 -0.861651 2.837177
H  3.230342 -1.706814 4.268895
H  2.08778 -0.859805 3.2353
H  2.465234 0.886464 -2.107335
H  5.1406 0.306165 1.198536
H  4.16122 -0.010873 -3.630165
H  6.830483 -0.62108 -0.341163
H  6.353398 -0.777014 -2.769488
elementType: Cl O N C H
totalener: -2279.55669088 hartree
nucrepener: 3819.98628382 hartree
electener: -6099.54297470 hartree
twoeener: 4623.20375178 hartree
cpcmener: -0.03619198 hartree
kineticenergy: 2272.45141155 hartree
xcener: -173.464800691834 hartree
chargesum: 0.0000000
charge: -0.072356 -0.084644 -0.252786 -0.380815 -0.327484 -0.320814 -0.081849 0.075364 0.147182 -0.129082 0.081747 0.274129 -0.164770 -0.267155 -0.262245 -0.185978 0.378171 0.311910 0.040142 -0.223155 -0.268465 -0.184692 0.037128 0.243396 -0.117309 -0.181995 -0.272253 0.340918 -0.220919 -0.288960 -0.154262 -0.114708 -0.181595 0.109858 0.097960 0.144737 0.143212 0.137749 0.142124 0.145110 0.159836 0.145175 0.092910 0.110799 0.160340 0.156954 0.086248 0.103555 0.089914 0.151100 0.159205 0.157634 0.156229 0.157560
qa: -0.0724 -0.0846 -0.2528 -0.3808 -0.3275 -0.3208 -0.0818 0.0754 0.1472 -0.1291 0.0817 0.2741 -0.1648 -0.2672 -0.2622 -0.1860 0.3782 0.3119 0.0401 -0.2232 -0.2685 -0.1847 0.0371 0.2434 -0.1173 -0.1820 -0.2723 0.3409 -0.2209 -0.2890 -0.1543 -0.1147 -0.1816 0.1099 0.0980 0.1447 0.1432 0.1377 0.1421 0.1451 0.1598 0.1452 0.0929 0.1108 0.1603 0.1570 0.0862 0.1036 0.0899 0.1511 0.1592 0.1576 0.1562 0.1576
va: 1.2334 1.2306 2.1404 2.1260 2.0699 2.0410 3.1091 3.5780 4.2710 4.0003 3.3262 4.2545 3.9584 3.9962 3.9821 3.8514 3.7528 3.7587 3.6013 4.0801 4.0490 3.9653 3.8462 3.8070 3.8932 3.9452 3.9153 3.5234 3.8702 4.0010 3.9064 3.8925 3.9114 1.0258 1.0393 0.9995 1.0220 1.0076 1.0042 1.0137 0.9912 1.0023 0.9971 0.9925 0.9895 0.9956 1.0061 1.0130 1.0012 1.0031 0.9978 0.9903 0.9900 0.9898
dispcorr: -0.037600488 hartree
energy: -2279.594291366245
dipole: 45.70714 -44.01132 1.69582 1.55873 -1.77299 -0.21426 2.93277 -4.21370 -1.28093
magnitude: 2.13600 au
magnitude: 5.42928 debye
