program: Orca
programVersion: 5.0.2
elementType: Cl Cl O O O O N C C C C C C C C C C C C C C C C C C C C C C C C C C H H H H H H H H H H H H H H H H H H H H H
charge: 0
multiplicity: 1
keywords: wb97x-d3
keywords: def2-TZVPP
keywords: def2/J RIJCOSX
keywords: DEFGRID2
keywords: scfconv7
keywords: smallprint printgap noloewdin
keywords: NOSOSCF
formula: C26H21Cl2NO4
InChI: InChI=1/C26H21Cl2NO4/c1-2-31-20-13-11-19(12-14-20)25(17-26(25,27)28)24(30)33-23(16-29)18-7-6-10-22(15-18)32-21-8-4-3-5-9-21/h3-15,23H,2,17H2,1H3
54 atoms
Cl -3.80597 -2.650709 0.708523
Cl -4.939258 -0.272094 -0.52399
O  -1.966264 1.218268 -0.153982
O  -2.069978 0.928094 -2.376797
O  2.595065 -2.55152 1.460355
O  3.186442 0.890692 0.500241
N  -3.144551 4.253443 0.548951
C  -2.258884 -0.95876 -0.899741
C  -3.632567 -1.443762 -0.540517
C  -3.042611 -1.825623 -1.844354
C  -1.033168 -1.464175 -0.213484
C  -2.113721 0.492234 -1.262114
C  -0.038018 -2.095145 -0.95491
C  -0.800468 -1.215274 1.133767
C  1.159459 -2.460773 -0.370369
C  0.397675 -1.572229 1.733596
C  -1.365499 2.509648 -0.232298
C  1.394417 -2.189277 0.978897
C  -0.121974 2.475839 0.62435
C  -2.360706 3.485075 0.212348
C  0.962301 1.762428 0.11952
C  -0.067303 3.03907 1.889753
C  2.94495 -2.202759 2.794927
C  2.105252 1.619542 0.891413
C  1.084074 2.885695 2.651764
C  2.169308 2.182038 2.162105
C  4.354728 -2.67668 3.045386
C  3.520278 0.751965 -0.820368
C  3.481619 1.814337 -1.715484
C  3.974855 -0.495346 -1.223521
C  3.876062 1.606829 -3.029619
C  4.375755 -0.685123 -2.538151
C  4.319202 0.359823 -3.449462
H  -2.720835 -2.852177 -1.966659
H  -3.456457 -1.373613 -2.737512
H  -0.193057 -2.297567 -2.007863
H  -1.553254 -0.72676 1.73851
H  1.924801 -2.949271 -0.960256
H  0.537372 -1.353905 2.783408
H  -1.10838 2.758161 -1.266521
H  0.901041 1.314646 -0.865744
H  -0.904515 3.592317 2.295692
H  2.873489 -1.118451 2.931991
H  2.255075 -2.674235 3.502479
H  1.134912 3.323475 3.639814
H  3.064731 2.063752 2.759298
H  5.066767 -2.195709 2.373723
H  4.441378 -3.757411 2.928271
H  4.642535 -2.42928 4.067369
H  3.150771 2.796381 -1.401366
H  4.018779 -1.310192 -0.512763
H  3.839593 2.433438 -3.727477
H  4.726845 -1.660859 -2.848395
H  4.622295 0.205912 -4.476714
elementType: Cl O N C H
totalener: -2279.55798408 hartree
nucrepener: 3811.96487938 hartree
electener: -6091.52286346 hartree
twoeener: 4614.52993109 hartree
cpcmener: -0.03451479 hartree
kineticenergy: 2272.43375649 hartree
xcener: -173.458941759352 hartree
chargesum: -0.0000000
charge: -0.074221 -0.084253 -0.246143 -0.387342 -0.321341 -0.322328 -0.079295 0.052699 0.151848 -0.127370 0.068628 0.318607 -0.169986 -0.255071 -0.250156 -0.188536 0.397316 0.305655 -0.031944 -0.235015 -0.212036 -0.183044 0.048903 0.319545 -0.096933 -0.270570 -0.272228 0.324757 -0.210431 -0.280671 -0.142015 -0.117609 -0.181761 0.110249 0.098073 0.146445 0.143308 0.135788 0.139732 0.142588 0.151235 0.137923 0.087947 0.106056 0.159886 0.146807 0.089036 0.088543 0.092200 0.154553 0.148716 0.158885 0.156983 0.157390
qa: -0.0742 -0.0843 -0.2461 -0.3873 -0.3213 -0.3223 -0.0793 0.0527 0.1518 -0.1274 0.0686 0.3186 -0.1700 -0.2551 -0.2502 -0.1885 0.3973 0.3057 -0.0319 -0.2350 -0.2120 -0.1830 0.0489 0.3195 -0.0969 -0.2706 -0.2722 0.3248 -0.2104 -0.2807 -0.1420 -0.1176 -0.1818 0.1102 0.0981 0.1464 0.1433 0.1358 0.1397 0.1426 0.1512 0.1379 0.0879 0.1061 0.1599 0.1468 0.0890 0.0885 0.0922 0.1546 0.1487 0.1589 0.1570 0.1574
va: 1.2326 1.2323 2.1220 2.1192 2.0711 2.0513 3.1119 3.5967 4.2704 3.9942 3.3604 4.2304 3.9903 3.9880 3.9608 3.8418 3.7345 3.7451 3.8026 4.0772 3.8712 3.9467 3.8027 3.5706 3.9146 4.0286 3.9735 3.6554 3.9298 3.9461 3.8918 3.8954 3.9170 1.0254 1.0391 0.9984 1.0222 1.0114 1.0100 1.0250 1.0033 1.0139 0.9856 0.9889 0.9887 1.0069 1.0024 1.0043 1.0059 0.9979 1.0184 0.9898 0.9913 0.9903
dispcorr: -0.036613370 hartree
energy: -2279.594597454625
dipole: 47.02272 -44.43461 2.58811 -3.74593 2.66178 -1.08415 5.57017 -5.24325 0.32693
magnitude: 2.82500 au
magnitude: 7.18057 debye
