program: Orca
programVersion: 5.0.2
elementType: Cl Cl O O O O N C C C C C C C C C C C C C C C C C C C C C C C C C C H H H H H H H H H H H H H H H H H H H H H
charge: 0
multiplicity: 1
keywords: wb97x-d3
keywords: def2-TZVPP
keywords: def2/J RIJCOSX
keywords: DEFGRID2
keywords: scfconv7
keywords: smallprint printgap noloewdin
keywords: NOSOSCF
formula: C26H21Cl2NO4
InChI: InChI=1/C26H21Cl2NO4/c1-2-31-20-13-11-19(12-14-20)25(17-26(25,27)28)24(30)33-23(16-29)18-7-6-10-22(15-18)32-21-8-4-3-5-9-21/h3-15,23H,2,17H2,1H3
54 atoms
Cl -3.811004 -2.935742 0.146529
Cl -5.000126 -0.29598 0.116189
O  -1.538223 1.041827 0.514016
O  -2.77862 1.596967 -1.256463
O  2.325322 -3.684561 0.197938
O  3.258204 3.007149 -0.792044
N  -0.610944 2.456491 3.33697
C  -2.362558 -0.72072 -0.785732
C  -3.727394 -1.322567 -0.516516
C  -3.276159 -1.145939 -1.90916
C  -1.131875 -1.508816 -0.486472
C  -2.26537 0.762106 -0.565044
C  -0.287514 -1.899636 -1.521601
C  -0.788178 -1.853185 0.814428
C  0.862702 -2.622458 -1.267456
C  0.361419 -2.579768 1.086737
C  -1.361117 2.422209 0.835604
C  1.194803 -2.974796 0.041331
C  -0.33261 3.08468 -0.04803
C  -0.947453 2.425969 2.239862
C  0.998702 2.681586 0.017534
C  -0.735145 4.073131 -0.932563
C  2.768314 -4.007194 1.510807
C  1.927827 3.284231 -0.818493
C  0.20688 4.665738 -1.762194
C  1.531509 4.272881 -1.714991
C  4.078306 -4.745067 1.390932
C  3.735321 1.835071 -0.262786
C  3.342166 0.601916 -0.766147
C  4.691222 1.92533 0.737436
C  3.925822 -0.549605 -0.258806
C  5.269435 0.765011 1.233441
C  4.888716 -0.474541 0.739526
H  -3.004128 -2.036982 -2.460616
H  -3.750277 -0.375016 -2.502993
H  -0.5290 -1.63866 -2.544918
H  -1.423591 -1.562139 1.641255
H  1.510141 -2.921852 -2.082401
H  0.585797 -2.831845 2.114122
H  -2.312882 2.959027 0.774035
H  1.30365 1.917288 0.723461
H  -1.771715 4.380325 -0.975027
H  2.895804 -3.093987 2.102034
H  2.02467 -4.631076 2.018191
H  -0.095863 5.436847 -2.45806
H  2.266544 4.734581 -2.362395
H  4.438373 -5.005652 2.386299
H  4.842356 -4.132142 0.910701
H  3.968011 -5.670033 0.823887
H  2.601018 0.537701 -1.553622
H  4.987509 2.896073 1.114748
H  3.637707 -1.511488 -0.659525
H  6.019757 0.834905 2.01038
H  5.344887 -1.377527 1.124103
elementType: Cl O N C H
totalener: -2279.56065018 hartree
nucrepener: 3719.41768682 hartree
electener: -5998.97833701 hartree
twoeener: 4522.33471956 hartree
cpcmener: -0.03462746 hartree
kineticenergy: 2272.43512537 hartree
xcener: -173.457396415111 hartree
chargesum: 0.0000000
charge: -0.073624 -0.081218 -0.246597 -0.404685 -0.323255 -0.323075 -0.081820 0.043797 0.135866 -0.116045 0.037398 0.362145 -0.152180 -0.249068 -0.264403 -0.173548 0.379209 0.286698 0.011541 -0.230102 -0.204105 -0.187039 0.034165 0.264404 -0.113421 -0.237619 -0.270823 0.267496 -0.182434 -0.226161 -0.148468 -0.131901 -0.178515 0.111577 0.096694 0.147726 0.147389 0.138245 0.141315 0.144569 0.142168 0.143387 0.098172 0.109843 0.157685 0.147510 0.091901 0.084338 0.091551 0.154737 0.145960 0.165547 0.157360 0.159716
qa: -0.0736 -0.0812 -0.2466 -0.4047 -0.3233 -0.3231 -0.0818 0.0438 0.1359 -0.1160 0.0374 0.3621 -0.1522 -0.2491 -0.2644 -0.1735 0.3792 0.2867 0.0115 -0.2301 -0.2041 -0.1870 0.0342 0.2644 -0.1134 -0.2376 -0.2708 0.2675 -0.1824 -0.2262 -0.1485 -0.1319 -0.1785 0.1116 0.0967 0.1477 0.1474 0.1382 0.1413 0.1446 0.1422 0.1434 0.0982 0.1098 0.1577 0.1475 0.0919 0.0843 0.0916 0.1547 0.1460 0.1655 0.1574 0.1597
va: 1.2297 1.2331 2.1653 2.1133 2.0636 2.0874 3.1094 3.6346 4.2725 3.9810 3.3956 4.1687 3.9527 4.0151 3.9559 3.8649 3.7601 3.7886 3.6144 4.0729 3.9546 3.9480 3.7950 3.7797 3.9148 4.0017 3.9723 3.7127 3.9430 4.0177 3.8485 3.9034 3.9043 1.0268 1.0454 0.9971 1.0164 1.0133 1.0088 1.0116 1.0134 1.0105 0.9851 0.9890 0.9896 1.0064 1.0055 1.0027 1.0042 1.0010 1.0065 0.9944 0.9899 0.9876
dispcorr: -0.033215506 hartree
energy: -2279.593865688637
dipole: 43.15843 -42.19767 0.96075 -8.42745 7.61295 -0.81450 -0.18961 -0.80262 -0.99223
magnitude: 1.60343 au
magnitude: 4.07559 debye
