program: Orca
programVersion: 5.0.2
elementType: Cl Cl O O O O N C C C C C C C C C C C C C C C C C C C C C C C C C C H H H H H H H H H H H H H H H H H H H H H
charge: 0
multiplicity: 1
keywords: wb97x-d3
keywords: def2-TZVPP
keywords: def2/J RIJCOSX
keywords: DEFGRID2
keywords: scfconv7
keywords: smallprint printgap noloewdin
keywords: NOSOSCF
formula: C26H21Cl2NO4
InChI: InChI=1/C26H21Cl2NO4/c1-2-31-20-13-11-19(12-14-20)25(17-26(25,27)28)24(30)33-23(16-29)18-7-6-10-22(15-18)32-21-8-4-3-5-9-21/h3-15,23H,2,17H2,1H3
54 atoms
Cl -4.051001 -2.69494 0.607187
Cl -5.219587 -0.196171 -0.317618
O  -2.362419 1.268547 0.140515
O  -2.248425 1.195576 -2.099709
O  2.410106 -2.616061 1.091268
O  2.766111 2.163653 -1.386703
N  -3.04934 3.8658 2.069116
C  -2.556941 -0.827239 -0.849518
C  -3.914536 -1.353984 -0.501112
C  -3.369559 -1.583129 -1.861197
C  -1.299161 -1.396371 -0.2815
C  -2.399494 0.652991 -1.042212
C  -0.331071 -1.916954 -1.137072
C  -1.011887 -1.30759 1.074409
C  0.893645 -2.33297 -0.652508
C  0.212691 -1.723095 1.575922
C  -1.763909 2.566978 0.205534
C  1.18261 -2.225146 0.709537
C  -0.297597 2.400087 0.512603
C  -2.485269 3.285522 1.254728
C  0.601599 2.393884 -0.544296
C  0.134437 2.126967 1.805514
C  2.804232 -2.431434 2.446503
C  1.941606 2.116068 -0.305817
C  1.47609 1.865461 2.029879
C  2.387672 1.856035 0.984402
C  4.25183 -2.834795 2.571812
C  3.928274 1.435425 -1.40363
C  5.095662 2.097498 -1.749465
C  3.930026 0.070154 -1.147652
C  6.279836 1.37962 -1.849668
C  5.122236 -0.632571 -1.239558
C  6.299407 0.016381 -1.591043
H  -3.050084 -2.588083 -2.107395
H  -3.814302 -1.036186 -2.683468
H  -0.531157 -1.990224 -2.199135
H  -1.743435 -0.905838 1.763269
H  1.641381 -2.730454 -1.32786
H  0.393361 -1.63764 2.638436
H  -1.908316 3.117552 -0.72837
H  0.269481 2.601189 -1.554493
H  -0.561813 2.118454 2.634965
H  2.676063 -1.382819 2.735673
H  2.177773 -3.038401 3.108537
H  1.823973 1.666985 3.03499
H  3.43216 1.655708 1.185238
H  4.57295 -2.707407 3.605717
H  4.895025 -2.21595 1.944903
H  4.403799 -3.880488 2.30258
H  5.07555 3.16208 -1.946371
H  3.011704 -0.442193 -0.888846
H  7.191235 1.894259 -2.125572
H  5.125324 -1.697126 -1.043166
H  7.224951 -0.539051 -1.666756
elementType: Cl O N C H
totalener: -2279.55824069 hartree
nucrepener: 3756.02208236 hartree
electener: -6035.58032306 hartree
twoeener: 4558.46977652 hartree
cpcmener: -0.03470153 hartree
kineticenergy: 2272.44518862 hartree
xcener: -173.458373631725 hartree
chargesum: 0.0000000
charge: -0.074345 -0.083957 -0.248884 -0.385169 -0.324584 -0.322352 -0.083320 0.065983 0.148390 -0.127856 0.074356 0.300128 -0.177308 -0.255210 -0.251561 -0.217188 0.379956 0.319476 0.013329 -0.222669 -0.220748 -0.195343 0.054194 0.288027 -0.165188 -0.172365 -0.270666 0.190367 -0.183765 -0.101287 -0.158456 -0.216345 -0.137650 0.109229 0.099680 0.148067 0.149196 0.143241 0.143522 0.139863 0.134680 0.140167 0.087120 0.103171 0.161016 0.152561 0.092436 0.083250 0.089542 0.146373 0.168198 0.157963 0.154522 0.158214
qa: -0.0743 -0.0840 -0.2489 -0.3852 -0.3246 -0.3224 -0.0833 0.0660 0.1484 -0.1279 0.0744 0.3001 -0.1773 -0.2552 -0.2516 -0.2172 0.3800 0.3195 0.0133 -0.2227 -0.2207 -0.1953 0.0542 0.2880 -0.1652 -0.1724 -0.2707 0.1904 -0.1838 -0.1013 -0.1585 -0.2163 -0.1377 0.1092 0.0997 0.1481 0.1492 0.1432 0.1435 0.1399 0.1347 0.1402 0.0871 0.1032 0.1610 0.1526 0.0924 0.0832 0.0895 0.1464 0.1682 0.1580 0.1545 0.1582
va: 1.2327 1.2320 2.1325 2.1195 2.0724 2.0858 3.1069 3.5817 4.2790 3.9849 3.3724 4.2574 4.0119 3.9906 3.9524 3.8471 3.7539 3.7568 3.6448 4.0724 4.0122 3.9302 3.8014 3.7474 3.9001 3.8602 3.9734 3.7913 3.9577 3.8366 3.9131 3.9381 3.8754 1.0251 1.0373 0.9982 1.0208 1.0090 1.0091 1.0209 1.0272 1.0098 0.9849 0.9886 0.9907 0.9986 1.0065 1.0025 1.0037 1.0063 0.9636 0.9895 0.9981 0.9900
dispcorr: -0.035718523 hartree
energy: -2279.593959216929
dipole: 51.91389 -49.13941 2.77448 -6.61318 5.13446 -1.47872 5.92721 -5.72072 0.20649
magnitude: 3.15071 au
magnitude: 8.00847 debye
