program: Orca
programVersion: 5.0.2
elementType: Cl Cl O O O O N C C C C C C C C C C C C C C C C C C C C C C C C C C H H H H H H H H H H H H H H H H H H H H H
charge: 0
multiplicity: 1
keywords: wb97x-d3
keywords: def2-TZVPP
keywords: def2/J RIJCOSX
keywords: DEFGRID2
keywords: scfconv7
keywords: smallprint printgap noloewdin
keywords: NOSOSCF
formula: C26H21Cl2NO4
InChI: InChI=1/C26H21Cl2NO4/c1-2-31-20-13-11-19(12-14-20)25(17-26(25,27)28)24(30)33-23(16-29)18-7-6-10-22(15-18)32-21-8-4-3-5-9-21/h3-15,23H,2,17H2,1H3
54 atoms
Cl -3.610823 -2.967505 0.384287
Cl -5.081427 -0.493536 -0.030115
O  -2.315356 1.193125 0.403781
O  -2.502185 1.452664 -1.810209
O  2.800179 -2.429722 0.369455
O  2.709951 1.417731 0.740284
N  -2.311525 3.086556 3.099717
C  -2.432701 -0.756799 -0.868543
C  -3.700942 -1.467731 -0.502916
C  -3.268098 -1.432149 -1.919857
C  -1.087891 -1.287411 -0.494571
C  -2.447076 0.744649 -0.844877
C  -0.163544 -1.587306 -1.491299
C  -0.691245 -1.398355 0.832068
C  1.121524 -1.981559 -1.172655
C  0.59568 -1.792103 1.167511
C  -1.989284 2.571886 0.559469
C  1.520387 -2.076892 0.162511
C  -0.562216 2.844079 0.144439
C  -2.183525 2.847086 1.983903
C  0.448421 2.010561 0.609717
C  -0.270233 3.890257 -0.716654
C  3.30936 -2.549195 1.693524
C  1.754383 2.232871 0.207926
C  1.047154 4.11156 -1.096974
C  2.064972 3.289747 -0.641221
C  2.934128 -3.858533 2.355001
C  3.689032 0.867879 -0.038895
C  3.511764 0.564953 -1.383368
C  4.877798 0.552144 0.606648
C  4.540227 -0.061825 -2.074333
C  5.89163 -0.080853 -0.095664
C  5.730089 -0.389108 -1.439865
H  -2.886185 -2.349918 -2.348933
H  -3.835127 -0.81534 -2.60641
H  -0.446723 -1.504878 -2.533689
H  -1.385344 -1.170413 1.630888
H  1.831263 -2.207648 -1.958493
H  0.854505 -1.862707 2.214872
H  -2.681681 3.210715 0.001808
H  0.23587 1.19109 1.285441
H  -1.061034 4.52925 -1.088399
H  4.391875 -2.49135 1.58048
H  3.007534 -1.692276 2.303024
H  1.2846 4.932324 -1.760614
H  3.088622 3.475277 -0.941916
H  3.416521 -3.916913 3.331688
H  3.277545 -4.708338 1.763924
H  1.860498 -3.964313 2.512567
H  2.58529 0.795533 -1.893194
H  4.999731 0.79163 1.655749
H  4.401042 -0.300471 -3.121056
H  6.814786 -0.327817 0.412929
H  6.524578 -0.878159 -1.987919
elementType: Cl O N C H
totalener: -2279.55759375 hartree
nucrepener: 3809.99958186 hartree
electener: -6089.55717561 hartree
twoeener: 4613.23390009 hartree
cpcmener: -0.03640598 hartree
kineticenergy: 2272.43917435 hartree
xcener: -173.461544590187 hartree
chargesum: -0.0000000
charge: -0.073794 -0.084886 -0.253052 -0.384113 -0.327903 -0.328761 -0.082691 0.080409 0.146548 -0.132185 0.089782 0.285186 -0.170159 -0.310340 -0.263504 -0.153751 0.382085 0.302751 0.045327 -0.221942 -0.282788 -0.189953 0.041206 0.246931 -0.116454 -0.187119 -0.263009 0.364900 -0.218655 -0.300471 -0.148806 -0.118463 -0.177606 0.109334 0.099144 0.148332 0.151054 0.136403 0.143474 0.144239 0.168608 0.147294 0.106120 0.089906 0.160739 0.158067 0.095349 0.089014 0.091509 0.150277 0.143797 0.157940 0.157578 0.157100
qa: -0.0738 -0.0849 -0.2531 -0.3841 -0.3279 -0.3288 -0.0827 0.0804 0.1465 -0.1322 0.0898 0.2852 -0.1702 -0.3103 -0.2635 -0.1538 0.3821 0.3028 0.0453 -0.2219 -0.2828 -0.1900 0.0412 0.2469 -0.1165 -0.1871 -0.2630 0.3649 -0.2187 -0.3005 -0.1488 -0.1185 -0.1776 0.1093 0.0991 0.1483 0.1511 0.1364 0.1435 0.1442 0.1686 0.1473 0.1061 0.0899 0.1607 0.1581 0.0953 0.0890 0.0915 0.1503 0.1438 0.1579 0.1576 0.1571
va: 1.2330 1.2313 2.1426 2.1236 2.0578 2.0476 3.1091 3.5887 4.2809 3.9929 3.2992 4.2419 4.0089 3.9990 3.9751 3.8337 3.7615 3.7494 3.6113 4.0801 4.0407 3.9763 3.8327 3.8125 3.8896 3.9457 3.9534 3.5164 3.8639 3.9762 3.9011 3.8546 3.9036 1.0257 1.0378 0.9978 1.0174 1.0133 1.0037 1.0138 1.0027 1.0021 0.9893 0.9930 0.9895 0.9950 1.0068 1.0050 1.0024 1.0034 1.0110 0.9905 0.9888 0.9896
dispcorr: -0.037367522 hartree
energy: -2279.594961272195
dipole: 45.76163 -43.95471 1.80692 -4.25634 3.78189 -0.47445 -1.77657 0.36647 -1.41010
magnitude: 2.34061 au
magnitude: 5.94935 debye
