program: Gaussian 09
title: 000073049
version: EM64L-G09RevD.01
frameworkgroup: C1[X(C21H28O8)]
method: RPBEPBE
basis: SDD
operation: Freq
keyword: #pfreq=noraman
keyword: PBEPBE/SDD
title: #p freq=noraman PBEPBE/SDD
converged: NO YES NO NO
title: Mulliken charges:
elementType: O O O O O O O O C C C C C C C C C C C C C C C C C C C C C H H H H H H H H H H H H H H H H H H H H H H H H H H H H
charge: -0.274550 -0.222289 -0.273769 -0.271660 -0.265479 -0.243590 -0.242475 -0.252825 0.312400 0.331794 0.313902 -0.299135 -0.204951 -0.113859 -0.468445 -0.145243 -0.857708 -0.514574 -0.490843 -0.462619 -0.565595 0.464624 0.301046 -0.826872 0.316104 0.303673 -0.764671 -0.767289 -0.756389 0.301471 0.267036 0.308217 0.222727 0.220941 0.222872 0.210631 0.239757 0.277234 0.217836 0.276462 0.280863 0.267676 0.224597 0.252163 0.217497 0.230691 0.229861 0.224532 0.249912 0.252417 0.248779 0.256366 0.249027 0.247766 0.245617 0.251787 0.246554
chargesum: 0.00000
title: Mulliken charges with hydrogens summed into heavy atoms:
elementType: O O O O O O O O C C C C C C C C C C C C C C C C C C C C C
charge: -0.274550 -0.222289 -0.273769 -0.271660 -0.265479 -0.243590 -0.242475 -0.252825 0.312400 0.331794 0.313902 0.002336 0.062085 0.194358 -0.024778 0.077629 -0.130086 -0.020276 0.057695 -0.238022 -0.095935 0.464624 0.301046 -0.141787 0.316104 0.303673 -0.013563 -0.014130 -0.012431
polarizability: 2.76867163e+02 -5.83814050e+00 2.43822271e+02 -7.70040458e+00 1.23830981e+01 2.12647959e+02
1716.lowfreq: -8.6139 -5.2085 -0.0005 0.0004 0.0005 7.8512 28.5210 29.4897 31.9119
frequency: 28.5128 29.4112 31.7304 40.4091 42.3147 53.6279 55.9843 57.2555 63.5905 69.8200 78.6096 83.2688 89.2929 113.1442 129.7145 154.6883 158.5286 179.9877 182.8536 194.6069 201.6671 219.9354 234.7551 240.5117 250.9067 256.6466 265.1804 275.0740 299.6924 313.7445 316.9916 325.9812 329.8632 359.5601 371.0257 405.0516 416.4261 432.8165 459.1578 474.6576 495.0064 503.7676 525.3937 544.4604 559.0275 561.4798 564.0746 591.1792 597.7154 611.1286 637.5878 661.0154 674.5896 726.0258 741.4787 763.6121 778.8205 795.3408 813.6983 823.0735 824.0475 852.7595 858.6941 878.2167 893.0749 903.6522 907.8479 922.9756 924.9509 944.4052 956.6052 967.6241 981.8796 984.8790 995.4340 999.4677 1010.6446 1017.8447 1026.0755 1038.8750 1040.9182 1041.4245 1042.9580 1050.7994 1056.4582 1084.2439 1100.3530 1107.4226 1120.5798 1140.9924 1148.0318 1158.2868 1178.0295 1183.1986 1187.3803 1194.8019 1195.8647 1206.8951 1209.7228 1223.9800 1248.8144 1257.5521 1276.3454 1277.7584 1304.5883 1320.5858 1324.6752 1332.9237 1342.9870 1351.2852 1360.6993 1373.2748 1380.0085 1381.9116 1383.7980 1385.6639 1386.3342 1392.9223 1402.8257 1451.7928 1452.2510 1453.0938 1453.5996 1454.3872 1454.7457 1454.9260 1459.3367 1461.5971 1469.0900 1472.9227 1477.6442 1484.2644 1495.9162 1649.0654 1649.9679 1655.5255 1695.4036 2950.7094 2963.0166 2969.3376 3001.9871 3006.6531 3007.0916 3007.8712 3008.2190 3015.9932 3029.2040 3038.3404 3042.9071 3066.7459 3068.0647 3081.5135 3083.0661 3086.8765 3092.0472 3095.2620 3096.9608 3098.9794 3111.1483 3118.1528 3118.9332 3141.5354 3141.8534 3144.5025 3172.8265
redmass: 1.1951 5.6858 6.5349 5.4991 3.1595 1.6077 1.3490 3.7799 2.9875 2.4891 2.9970 3.2931 3.3353 3.7231 4.8838 2.6691 2.7521 1.6899 3.8435 5.7894 1.7495 4.0657 4.3734 3.7249 3.4647 3.7317 3.4088 3.8269 3.2440 2.7229 2.4692 3.3957 2.7667 3.4625 3.3075 3.2799 4.1130 3.1054 3.5851 2.9902 4.1653 4.4721 3.5041 4.2210 3.1486 3.2751 3.1711 4.6654 4.6282 5.0075 4.3663 4.4513 4.6420 2.9033 3.6687 2.2432 3.9190 3.6351 5.0119 5.2494 3.2003 2.3773 3.9906 2.3136 2.7867 3.4144 3.1425 2.4189 2.2888 3.1912 2.7352 3.9014 2.1884 2.1634 2.1296 2.0898 2.7343 1.7719 3.0892 1.6757 1.6619 1.6470 1.6524 1.8157 2.0669 2.2925 2.5522 2.2033 1.4607 2.0645 2.0893 3.2629 2.5107 2.2585 1.6722 3.6572 3.1485 2.4680 2.0164 1.5048 1.5151 1.6070 1.1757 2.3677 1.3315 1.3253 1.3945 1.2912 1.3579 1.3061 1.4763 1.8175 1.7972 1.3928 1.2584 1.2538 1.3211 1.2543 1.2722 1.0638 1.0780 1.0623 1.0573 1.0475 1.0504 1.0523 1.0794 1.0529 1.0687 1.2356 1.0701 1.0639 1.0581 8.9031 9.3571 9.8319 6.7017 1.0826 1.0409 1.0565 1.0371 1.0373 1.0379 1.0370 1.0953 1.0566 1.0635 1.0966 1.0845 1.0537 1.0841 1.1071 1.0987 1.0990 1.1014 1.0972 1.0964 1.0952 1.0894 1.0984 1.0913 1.1014 1.1019 1.1009 1.1176
irintensity: 1.4599 0.1260 0.2874 0.7311 1.8043 2.5454 1.1730 2.2519 1.8909 0.9549 3.8026 1.7357 0.5115 0.2651 1.7654 1.6993 3.0753 0.1244 1.5929 11.5877 1.7728 3.8106 1.6461 0.1637 2.3602 6.5408 1.7833 10.9274 5.9803 0.5454 4.9875 5.3940 2.1922 3.1849 2.7284 2.8043 1.5471 2.8823 1.7070 18.3995 18.6141 9.7175 3.6364 7.3605 3.0808 4.8666 3.2838 9.5853 1.8741 3.3526 2.0797 18.5992 8.6229 2.9931 1.9684 5.4366 6.1458 7.3855 11.0977 23.2673 32.5311 1.9806 28.2576 10.4056 17.0372 73.9243 53.0874 16.3151 12.2811 1.5376 46.4875 85.1195 4.1820 22.3163 113.6868 136.1827 82.3130 25.9906 46.0888 3.0609 9.7094 11.8310 11.1130 3.1569 15.3795 1.8641 1.7812 2.9165 9.8771 3.5780 30.5105 22.3692 6.2774 28.4546 105.0825 446.4007 321.9404 135.7411 53.2647 3.6413 2.3237 3.5457 10.0161 2.0248 5.6395 0.5830 5.8590 0.7515 0.9103 3.8117 2.4878 2.6649 5.0695 58.4135 51.0011 52.6846 21.9602 21.3637 20.9396 22.7511 25.5347 8.0654 21.9694 17.2732 17.0648 18.4436 8.1973 20.2594 18.9681 8.1740 3.6625 44.0805 8.9493 269.4238 84.2555 136.5052 22.2320 28.7051 15.2026 57.0647 16.7108 2.4614 1.2812 1.9063 12.7307 9.8648 20.5479 21.1910 4.7581 21.3053 10.6198 3.3049 23.1429 23.7073 15.5376 5.9744 7.2071 7.2840 6.3546 6.2864 23.4198 11.5202 9.2124 8.7086 15.6598
temp: 298.150 k
press: 1.00000 atm
elementType: 8 8 8 8 8 8 8 8 6 6 6 6 6 6 6 6 6 6 6 6 6 6 6 6 6 6 6 6 6 1 1 1 1 1 1 1 1 1 1 1 1 1 1 1 1 1 1 1 1 1 1 1 1 1 1 1 1
symmnumber: 1
zpe: 1203491.4 jmol-1
zpe.correction: 0.458386 hartree
zpe.thermalcorrener: 0.488897 hartree
zpe.thermalcorrenthalpy: 0.489841 hartree
zpe.thermalcorrgfe: 0.395224 hartree
zpe.sumelectzpe: -1416.556169 hartree
zpe.sumelectthermal: -1416.525658 hartree
zpe.sumelectthermalent: -1416.524714 hartree
zpe.sumelectthermalfe: -1416.619331 hartree
dipole: -0.8434 3.3852 0.0970
dipole: 3.4900
quadrupole: -169.2951 -158.7473 -175.8341
quadrupole: -6.5680 13.5078 14.2509
quadrupole: -1.3363 9.2115 -7.8752 -6.5680 13.5078 14.2509
hfenergy: -1417.014555 hartree
pointgroup: C01[X(C21H28O8)]
dipole: 0.5264737 -1.2576659 0.1627065 debye
polarizability: 275.8624434|1.2770563|241.2975921|14.6615922|-12.7841868|216.1773577 unknown
InChI: InChI=1S/C21H28O8/c1-11-6-7-20(9-25-12(2)22)15(8-11)29-18-16(27-13(3)23)17(28-14(4)24)19(20,5)21(18)10-26-21/h8,15-18H,6-7,9-10H2,1-5H3
charge 0 multiplicity 1
57 atoms
O  0.016573 0.761082 3.281243
O  0.414405 2.240581 0.4633
O  2.266051 -1.903853 0.332561
O  2.611452 1.137008 -1.040275
O  -2.494818 -1.805403 -0.429212
O  1.200237 -3.107287 -1.362505
O  4.245818 2.415284 0.022744
O  -4.084736 -1.27859 -2.064657
C  0.163321 -0.608443 1.003178
C  0.751831 0.379839 2.040024
C  -1.021677 0.133004 0.216662
C  1.41721 1.455943 1.185254
C  1.409475 -0.724183 0.026807
C  2.272536 0.53418 0.266513
C  1.31723 -0.005929 3.370883
C  -0.452755 1.433627 -0.463559
C  -0.269798 -1.951344 1.613352
C  -2.176586 0.560472 1.165952
C  -1.565812 -0.751841 -0.942992
C  -1.513328 2.393202 -0.942914
C  -3.313793 1.290191 0.413444
C  -2.81565 2.352208 -0.55176
C  2.060924 -3.048208 -0.45638
C  -3.846629 3.328813 -1.07539
C  3.62233 2.115435 -1.018334
C  -3.707496 -1.99052 -1.10697
C  3.019186 -4.143779 -0.050401
C  3.804243 2.717439 -2.391166
C  -4.455795 -3.166247 -0.517344
H  2.017019 2.192351 1.737964
H  1.108389 -0.809969 -1.029602
H  3.206975 0.271864 0.794171
H  1.215109 -1.03344 3.736126
H  2.158393 0.56847 3.780358
H  0.190095 1.148248 -1.324275
H  0.595572 -2.469142 2.061451
H  -1.016021 -1.782449 2.408836
H  -0.721405 -2.613843 0.860282
H  -2.584691 -0.320806 1.689627
H  -1.766165 1.238607 1.931834
H  -2.117994 -0.139675 -1.676973
H  -0.763868 -1.307768 -1.458316
H  -1.169456 3.176845 -1.62955
H  -3.947672 0.575697 -0.151035
H  -3.989684 1.76201 1.15491
H  -4.679533 2.793224 -1.572284
H  -3.412974 4.03921 -1.799934
H  -4.293073 3.911291 -0.245499
H  2.865832 -5.026113 -0.687645
H  4.060891 -3.791397 -0.143354
H  2.859062 -4.416548 1.007316
H  3.003754 3.457763 -2.572291
H  3.728079 1.945081 -3.17318
H  4.77675 3.227925 -2.447287
H  -5.489585 -3.174413 -0.892003
H  -3.957658 -4.106794 -0.813973
H  -4.446994 -3.120212 0.584165
