program: Orca
programVersion: 5.0.2
elementType: Cl Cl O O O O N C C C C C C C C C C C C C C C C C C C C C C C C C C H H H H H H H H H H H H H H H H H H H H H
charge: 0
multiplicity: 1
keywords: wb97x-d3
keywords: def2-TZVPP
keywords: def2/J RIJCOSX
keywords: DEFGRID2
keywords: scfconv7
keywords: smallprint printgap noloewdin
keywords: NOSOSCF
formula: C26H21Cl2NO4
InChI: InChI=1/C26H21Cl2NO4/c1-2-31-20-13-11-19(12-14-20)25(17-26(25,27)28)24(30)33-23(16-29)18-7-6-10-22(15-18)32-21-8-4-3-5-9-21/h3-15,23H,2,17H2,1H3
54 atoms
Cl -3.592883 -2.876156 0.26552
Cl -4.826763 -0.319612 -0.352297
O  -2.08556 1.157965 0.369602
O  -1.97287 1.415107 -1.849993
O  2.70929 -3.075348 0.870785
O  2.9100 1.857126 0.718057
N  -2.625725 2.990656 3.049629
C  -2.128539 -0.790536 -0.900998
C  -3.478856 -1.40097 -0.656627
C  -2.902352 -1.428931 -2.020741
C  -0.877441 -1.425275 -0.386783
C  -2.06447 0.708675 -0.884966
C  0.05273 -1.943999 -1.283913
C  -0.585558 -1.468098 0.971333
C  1.238428 -2.495493 -0.838999
C  0.607937 -2.005288 1.432291
C  -1.935779 2.555557 0.567131
C  1.531104 -2.524074 0.525072
C  -0.517599 3.034329 0.352438
C  -2.328681 2.783351 1.95841
C  0.556145 2.195012 0.614672
C  -0.304356 4.340718 -0.066251
C  3.143297 -2.991787 2.225225
C  1.842489 2.676962 0.43743
C  0.990875 4.811269 -0.217437
C  2.074123 3.979012 0.025206
C  4.534076 -3.569845 2.304036
C  3.307354 0.946133 -0.224764
C  2.830546 0.937767 -1.529776
C  4.259073 0.018513 0.185899
C  3.325694 -0.002455 -2.425001
C  4.741229 -0.911521 -0.720776
C  4.280605 -0.927469 -2.031433
H  -2.547108 -2.380823 -2.394376
H  -3.352532 -0.792219 -2.772069
H  -0.150259 -1.920136 -2.347193
H  -1.290298 -1.081835 1.695903
H  1.949112 -2.901044 -1.547295
H  0.79378 -2.019634 2.497229
H  -2.625919 3.119358 -0.069448
H  0.412108 1.176142 0.954056
H  -1.147054 4.989158 -0.269765
H  3.142028 -1.948125 2.555253
H  2.460282 -3.547331 2.875427
H  1.15901 5.829765 -0.539156
H  3.087091 4.337576 -0.103207
H  4.890433 -3.511485 3.331944
H  5.233785 -3.016908 1.676264
H  4.551608 -4.617912 2.004616
H  2.089303 1.651355 -1.864306
H  4.620725 0.030962 1.206589
H  2.953609 -0.004462 -3.441172
H  5.482931 -1.629796 -0.39645
H  4.659492 -1.655754 -2.735634
elementType: Cl O N C H
totalener: -2279.54590314 hartree
nucrepener: 3813.25285204 hartree
electener: -6092.79875518 hartree
twoeener: 4616.43194146 hartree
cpcmener: -0.04383956 hartree
kineticenergy: 2272.43226534 hartree
xcener: -173.460279195111 hartree
chargesum: 0.0000000
charge: -0.074750 -0.086785 -0.257019 -0.407498 -0.333823 -0.338850 -0.094532 0.087256 0.141848 -0.124736 0.055629 0.326594 -0.185604 -0.282224 -0.248299 -0.143165 0.373142 0.280419 -0.036018 -0.215886 -0.122390 -0.160771 0.021802 0.146089 -0.142990 -0.142961 -0.266484 0.332474 -0.202291 -0.238452 -0.171477 -0.144329 -0.197432 0.110074 0.100698 0.147412 0.150210 0.143237 0.145443 0.153386 0.171163 0.149407 0.104372 0.115895 0.163685 0.153993 0.093961 0.083542 0.090616 0.145483 0.144105 0.160135 0.167544 0.159151
qa: -0.0748 -0.0868 -0.2570 -0.4075 -0.3338 -0.3389 -0.0945 0.0873 0.1418 -0.1247 0.0556 0.3266 -0.1856 -0.2822 -0.2483 -0.1432 0.3731 0.2804 -0.0360 -0.2159 -0.1224 -0.1608 0.0218 0.1461 -0.1430 -0.1430 -0.2665 0.3325 -0.2023 -0.2385 -0.1715 -0.1443 -0.1974 0.1101 0.1007 0.1474 0.1502 0.1432 0.1454 0.1534 0.1712 0.1494 0.1044 0.1159 0.1637 0.1540 0.0940 0.0835 0.0906 0.1455 0.1441 0.1601 0.1675 0.1592
va: 1.2330 1.2307 2.1350 2.0932 2.0459 2.0626 3.1083 3.5869 4.2831 3.9887 3.3284 4.1631 3.9936 4.0154 3.9510 3.8176 3.7293 3.7853 3.6784 4.0740 3.9386 3.9406 3.8012 3.8387 3.8855 3.9533 3.9668 3.6270 3.8159 3.9109 3.8741 3.8329 3.8525 1.0260 1.0375 1.0009 1.0193 1.0107 1.0077 1.0143 0.9987 0.9990 0.9825 0.9893 0.9879 0.9986 1.0065 1.0037 1.0030 1.0081 1.0094 0.9900 0.9801 0.9903
dispcorr: -0.037226027 hartree
energy: -2279.583129167646
dipole: 45.68430 -44.25840 1.42590 -5.01120 4.71745 -0.29375 0.05730 -1.23624 -1.17894
magnitude: 1.87333 au
magnitude: 4.76163 debye
