program: Orca
programVersion: 5.0.2
elementType: Cl Cl O O O O N C C C C C C C C C C C C C C C C C C C C C C C C C C H H H H H H H H H H H H H H H H H H H H H
charge: 0
multiplicity: 1
keywords: wb97x-d3
keywords: def2-TZVPP
keywords: def2/J RIJCOSX
keywords: DEFGRID2
keywords: scfconv7
keywords: smallprint printgap noloewdin
keywords: NOSOSCF
formula: C26H21Cl2NO4
InChI: InChI=1/C26H21Cl2NO4/c1-2-31-20-13-11-19(12-14-20)25(17-26(25,27)28)24(30)33-23(16-29)18-7-6-10-22(15-18)32-21-8-4-3-5-9-21/h3-15,23H,2,17H2,1H3
54 atoms
Cl -3.81039 -2.859599 0.481282
Cl -5.21568 -0.340587 0.120621
O  -2.405871 1.246279 0.3777
O  -2.585139 1.483951 -1.841838
O  2.572666 -2.640477 0.067724
O  2.620274 1.121248 0.829198
N  -2.255166 3.178124 3.043515
C  -2.633485 -0.711021 -0.870634
C  -3.901893 -1.368799 -0.420332
C  -3.555569 -1.363701 -1.861707
C  -1.289171 -1.291241 -0.575857
C  -2.571296 0.788306 -0.863145
C  -0.444109 -1.636362 -1.627568
C  -0.815728 -1.406788 0.724813
C  0.839811 -2.08603 -1.387204
C  0.470511 -1.858726 0.982558
C  -1.96781 2.599498 0.512394
C  1.31004 -2.198865 -0.076956
C  -0.525472 2.741172 0.091109
C  -2.132677 2.906774 1.932757
C  0.423469 1.889718 0.643232
C  -0.165726 3.672156 -0.871105
C  3.132903 -2.719073 1.375005
C  1.741303 1.970486 0.222313
C  1.162685 3.758335 -1.264025
C  2.121958 2.914866 -0.725916
C  4.56134 -3.181735 1.243034
C  3.761886 0.71391 0.182323
C  3.73594 0.245014 -1.124735
C  4.939481 0.719007 0.915242
C  4.912148 -0.21492 -1.69864
C  6.107217 0.247817 0.330667
C  6.100098 -0.215294 -0.977773
H  -3.231795 -2.298269 -2.301978
H  -4.14199 -0.733147 -2.518525
H  -0.790784 -1.549182 -2.649952
H  -1.446862 -1.137237 1.561812
H  1.48863 -2.34968 -2.212903
H  0.797867 -1.935641 2.010087
H  -2.606382 3.28463 -0.05385
H  0.150772 1.163792 1.399792
H  -0.911534 4.323537 -1.30757
H  3.090084 -1.739933 1.862596
H  2.558025 -3.42043 1.988332
H  1.458244 4.488917 -2.004781
H  3.15184 3.001502 -1.046246
H  5.011132 -3.245742 2.233291
H  5.156144 -2.485348 0.651169
H  4.622782 -4.169268 0.785396
H  2.81235 0.229152 -1.690555
H  4.939915 1.0829 1.934903
H  4.8943 -0.582495 -2.716314
H  7.025601 0.24804 0.903334
H  7.011874 -0.579674 -1.431838
elementType: Cl O N C H
totalener: -2279.54575860 hartree
nucrepener: 3801.96396169 hartree
electener: -6081.50972029 hartree
twoeener: 4605.26702842 hartree
cpcmener: -0.04135891 hartree
kineticenergy: 2272.42729621 hartree
xcener: -173.460113029504 hartree
chargesum: 0.0000000
charge: -0.075710 -0.085640 -0.255463 -0.408314 -0.331789 -0.336645 -0.095921 0.075427 0.146073 -0.126268 0.073717 0.306939 -0.160976 -0.277338 -0.268776 -0.198706 0.405220 0.317830 0.050564 -0.220277 -0.315268 -0.202253 0.024009 0.293207 -0.120156 -0.207204 -0.273588 0.349947 -0.230594 -0.269284 -0.142147 -0.126324 -0.169878 0.110847 0.100857 0.151783 0.155387 0.141841 0.144575 0.146074 0.156631 0.151392 0.100092 0.123137 0.163424 0.156588 0.096896 0.073511 0.096170 0.162636 0.146148 0.160622 0.158000 0.158974
qa: -0.0757 -0.0856 -0.2555 -0.4083 -0.3318 -0.3366 -0.0959 0.0754 0.1461 -0.1263 0.0737 0.3069 -0.1610 -0.2773 -0.2688 -0.1987 0.4052 0.3178 0.0506 -0.2203 -0.3153 -0.2023 0.0240 0.2932 -0.1202 -0.2072 -0.2736 0.3499 -0.2306 -0.2693 -0.1421 -0.1263 -0.1699 0.1108 0.1009 0.1518 0.1554 0.1418 0.1446 0.1461 0.1566 0.1514 0.1001 0.1231 0.1634 0.1566 0.0969 0.0735 0.0962 0.1626 0.1461 0.1606 0.1580 0.1590
va: 1.2311 1.2305 2.1483 2.0946 2.0460 2.0267 3.1085 3.6003 4.2866 3.9863 3.3214 4.2214 4.0056 3.9690 3.9721 3.8407 3.7435 3.7258 3.5992 4.0872 4.0482 3.9745 3.7940 3.7751 3.8936 3.9274 3.9562 3.4725 3.8836 4.0018 3.8972 3.8422 3.8598 1.0252 1.0371 0.9967 1.0151 1.0112 1.0102 1.0126 1.0102 1.0018 0.9798 0.9909 0.9887 0.9965 1.0063 1.0092 1.0068 0.9932 1.0084 0.9902 0.9901 0.9901
dispcorr: -0.037734897 hartree
energy: -2279.583493500970
dipole: 50.71100 -48.61561 2.09539 -3.58844 3.06099 -0.52745 -4.69073 3.16086 -1.52987
magnitude: 2.64752 au
magnitude: 6.72945 debye
