program: Orca
programVersion: 5.0.2
elementType: Cl Cl O O O O N C C C C C C C C C C C C C C C C C C C C C C C C C C H H H H H H H H H H H H H H H H H H H H H
charge: 0
multiplicity: 1
keywords: wb97x-d3
keywords: def2-TZVPP
keywords: def2/J RIJCOSX
keywords: DEFGRID2
keywords: scfconv7
keywords: smallprint printgap noloewdin
keywords: NOSOSCF
formula: C26H21Cl2NO4
InChI: InChI=1/C26H21Cl2NO4/c1-2-31-20-13-11-19(12-14-20)25(17-26(25,27)28)24(30)33-23(16-29)18-7-6-10-22(15-18)32-21-8-4-3-5-9-21/h3-15,23H,2,17H2,1H3
54 atoms
Cl -3.78679 -2.982397 -0.053495
Cl -5.119266 -0.433096 -0.462113
O  -2.275428 1.12026 0.498333
O  -2.403347 1.563439 -1.689047
O  2.597001 -2.599314 0.898148
O  2.778619 1.119291 0.62985
N  -2.089963 2.76505 3.351171
C  -2.385462 -0.719488 -0.932083
C  -3.709558 -1.415668 -0.814893
C  -3.07371 -1.281778 -2.144839
C  -1.119761 -1.319811 -0.41752
C  -2.380829 0.774582 -0.785152
C  -0.050357 -1.509018 -1.287981
C  -0.932278 -1.585138 0.933085
C  1.175988 -1.943661 -0.822067
C  0.292511 -2.021792 1.415305
C  -1.883084 2.46467 0.765002
C  1.364169 -2.191065 0.538422
C  -0.459593 2.71822 0.327037
C  -2.014449 2.618019 2.213183
C  0.533024 1.804516 0.666372
C  -0.160176 3.834637 -0.437236
C  2.885696 -2.872513 2.267581
C  1.830308 2.023466 0.236059
C  1.149754 4.048618 -0.845848
C  2.150587 3.151101 -0.513073
C  3.149522 -1.62165 3.077366
C  3.711462 0.669265 -0.268981
C  3.4269 0.491992 -1.617337
C  4.958858 0.336519 0.241042
C  4.408864 -0.020591 -2.453882
C  5.926251 -0.184797 -0.605643
C  5.658777 -0.362775 -1.956269
H  -2.648403 -2.173975 -2.586304
H  -3.521413 -0.596462 -2.85373
H  -0.172988 -1.310686 -2.34575
H  -1.7424 -1.442497 1.636171
H  1.9984 -2.088887 -1.510524
H  0.390068 -2.211269 2.475052
H  -2.563882 3.180859 0.294049
H  0.311556 0.925638 1.261134
H  -0.940714 4.531949 -0.712613
H  2.090513 -3.475782 2.713693
H  3.779929 -3.494718 2.24434
H  1.393634 4.922181 -1.435068
H  3.168362 3.329885 -0.835724
H  2.293042 -0.948379 3.108695
H  4.005984 -1.07277 2.686508
H  3.38065 -1.907602 4.103971
H  2.452737 0.737801 -2.019891
H  5.168177 0.482607 1.293137
H  4.185858 -0.159641 -3.503608
H  6.896622 -0.445361 -0.203986
H  6.416797 -0.764947 -2.61479
elementType: Cl O N C H
totalener: -2279.54328016 hartree
nucrepener: 3820.74792250 hartree
electener: -6100.29120265 hartree
twoeener: 4624.19399197 hartree
cpcmener: -0.04276496 hartree
kineticenergy: 2272.43899396 hartree
xcener: -173.463719388281 hartree
chargesum: 0.0000000
charge: -0.073542 -0.086196 -0.254882 -0.403154 -0.342690 -0.334517 -0.095900 0.081895 0.144819 -0.126016 0.088382 0.291761 -0.168874 -0.285912 -0.262850 -0.176227 0.392301 0.311307 0.038213 -0.215500 -0.295361 -0.189839 0.043106 0.252622 -0.121471 -0.178803 -0.278580 0.342267 -0.217633 -0.291209 -0.157610 -0.117347 -0.185061 0.111292 0.099360 0.148348 0.146091 0.140259 0.144620 0.148075 0.172825 0.150034 0.093492 0.112680 0.163767 0.158915 0.088316 0.091236 0.105982 0.155550 0.157830 0.161590 0.160725 0.161514
qa: -0.0735 -0.0862 -0.2549 -0.4032 -0.3427 -0.3345 -0.0959 0.0819 0.1448 -0.1260 0.0884 0.2918 -0.1689 -0.2859 -0.2628 -0.1762 0.3923 0.3113 0.0382 -0.2155 -0.2954 -0.1898 0.0431 0.2526 -0.1215 -0.1788 -0.2786 0.3423 -0.2176 -0.2912 -0.1576 -0.1173 -0.1851 0.1113 0.0994 0.1483 0.1461 0.1403 0.1446 0.1481 0.1728 0.1500 0.0935 0.1127 0.1638 0.1589 0.0883 0.0912 0.1060 0.1556 0.1578 0.1616 0.1607 0.1615
va: 1.2327 1.2298 2.1435 2.0990 2.0514 2.0221 3.1064 3.5786 4.2743 3.9950 3.3051 4.2297 3.9674 3.9952 3.9790 3.8448 3.7418 3.7432 3.6030 4.0861 4.0521 3.9602 3.8415 3.7959 3.8913 3.9362 3.9106 3.4858 3.8649 4.0049 3.8977 3.8797 3.9041 1.0256 1.0386 0.9986 1.0210 1.0089 1.0041 1.0128 0.9902 1.0011 0.9977 0.9922 0.9884 0.9951 1.0030 1.0040 1.0130 1.0006 0.9995 0.9893 0.9883 0.9883
dispcorr: -0.037669795 hartree
energy: -2279.580949951071
dipole: 46.17323 -44.47456 1.69867 0.75470 -1.04735 -0.29265 1.95833 -3.33205 -1.37372
magnitude: 2.20414 au
magnitude: 5.60249 debye
