program: Orca
programVersion: 5.0.2
elementType: Cl Cl O O O O N C C C C C C C C C C C C C C C C C C C C C C C C C C H H H H H H H H H H H H H H H H H H H H H
charge: 0
multiplicity: 1
keywords: wb97x-d3
keywords: def2-TZVPP
keywords: def2/J RIJCOSX
keywords: DEFGRID2
keywords: scfconv7
keywords: smallprint printgap noloewdin
keywords: NOSOSCF
formula: C26H21Cl2NO4
InChI: InChI=1/C26H21Cl2NO4/c1-2-31-20-13-11-19(12-14-20)25(17-26(25,27)28)24(30)33-23(16-29)18-7-6-10-22(15-18)32-21-8-4-3-5-9-21/h3-15,23H,2,17H2,1H3
54 atoms
Cl -4.147337 -2.763718 0.521982
Cl -5.331921 -0.132882 0.188068
O  -2.297337 1.208979 0.491541
O  -2.721515 1.541048 -1.680496
O  2.328639 -2.879613 0.110347
O  2.597266 0.630889 -0.048284
N  -1.715758 3.010782 3.18839
C  -2.777546 -0.686111 -0.775623
C  -4.098589 -1.256498 -0.354162
C  -3.731801 -1.254389 -1.789079
C  -1.47734 -1.362096 -0.489887
C  -2.628026 0.807386 -0.735879
C  -0.614882 -1.633169 -1.549463
C  -1.044379 -1.616743 0.804365
C  0.649048 -2.142198 -1.323989
C  0.219973 -2.136403 1.046368
C  -1.783394 2.532045 0.621347
C  1.079526 -2.393999 -0.020381
C  -0.395547 2.640071 0.032133
C  -1.757065 2.788124 2.060838
C  0.528792 1.637451 0.29108
C  -0.059756 3.721469 -0.768904
C  2.88867 -2.999079 1.4150
C  1.789536 1.702373 -0.283767
C  1.214158 3.786006 -1.31518
C  2.142461 2.780054 -1.089386
C  4.31072 -3.48164 1.275909
C  3.962349 0.722801 -0.151795
C  4.608428 -0.260259 -0.885924
C  4.681205 1.708252 0.512449
C  5.995324 -0.26332 -0.94572
C  6.066486 1.700362 0.433131
C  6.728161 0.71651 -0.290825
H  -3.465469 -2.204334 -2.23477
H  -4.261563 -0.577082 -2.447039
H  -0.931342 -1.433818 -2.565912
H  -1.687093 -1.4034 1.648507
H  1.313373 -2.341174 -2.155532
H  0.517299 -2.323819 2.068857
H  -2.453922 3.268188 0.166956
H  0.282102 0.794071 0.925055
H  -0.784737 4.499144 -0.970955
H  2.858396 -2.029936 1.922885
H  2.305896 -3.70724 2.012111
H  1.486032 4.622432 -1.944916
H  3.120254 2.841224 -1.548671
H  4.923425 -2.77533 0.714978
H  4.358661 -4.453295 0.783773
H  4.749828 -3.589607 2.267237
H  4.031272 -1.02015 -1.396817
H  4.172626 2.46912 1.091309
H  6.501089 -1.033884 -1.512434
H  6.630825 2.464803 0.950671
H  7.808785 0.712107 -0.340265
elementType: Cl O N C H
totalener: -2279.54483761 hartree
nucrepener: 3753.38362096 hartree
electener: -6032.92845857 hartree
twoeener: 4556.88137479 hartree
cpcmener: -0.04074621 hartree
kineticenergy: 2272.43213696 hartree
xcener: -173.459138313036 hartree
chargesum: -0.0000000
charge: -0.073197 -0.086349 -0.254234 -0.403917 -0.336099 -0.318588 -0.095958 0.073668 0.149836 -0.127438 0.079536 0.295437 -0.168620 -0.274747 -0.250730 -0.182757 0.392772 0.293154 0.061956 -0.218005 -0.337736 -0.213741 0.033569 0.298697 -0.114236 -0.216987 -0.267094 0.329739 -0.299702 -0.220519 -0.114081 -0.135737 -0.179683 0.111945 0.099793 0.151047 0.148640 0.141900 0.143102 0.149053 0.182258 0.149156 0.104267 0.112678 0.163755 0.156410 0.084897 0.089783 0.093190 0.150329 0.162639 0.162692 0.162559 0.161700
qa: -0.0732 -0.0863 -0.2542 -0.4039 -0.3361 -0.3186 -0.0960 0.0737 0.1498 -0.1274 0.0795 0.2954 -0.1686 -0.2747 -0.2507 -0.1828 0.3928 0.2932 0.0620 -0.2180 -0.3377 -0.2137 0.0336 0.2987 -0.1142 -0.2170 -0.2671 0.3297 -0.2997 -0.2205 -0.1141 -0.1357 -0.1797 0.1119 0.0998 0.1510 0.1486 0.1419 0.1431 0.1491 0.1823 0.1492 0.1043 0.1127 0.1638 0.1564 0.0849 0.0898 0.0932 0.1503 0.1626 0.1627 0.1626 0.1617
va: 1.2328 1.2292 2.1416 2.0979 2.0450 2.0510 3.1077 3.5891 4.2719 3.9936 3.3085 4.2272 3.9812 4.0001 3.9709 3.8684 3.7352 3.7545 3.6000 4.0877 4.0627 3.9808 3.7846 3.7778 3.8925 3.9532 3.9663 3.5788 3.9626 3.9678 3.8433 3.8822 3.9010 1.0254 1.0379 0.9972 1.0197 1.0106 1.0095 1.0133 0.9946 1.0014 0.9880 0.9896 0.9886 0.9979 1.0008 1.0044 1.0067 1.0126 0.9952 0.9893 0.9883 0.9885
dispcorr: -0.035497771 hartree
energy: -2279.580335381021
dipole: 51.67807 -49.59833 2.07974 -3.19537 2.92609 -0.26928 -3.28217 2.07010 -1.21207
magnitude: 2.42218 au
magnitude: 6.15669 debye
