program: Orca
programVersion: 5.0.2
elementType: Cl Cl O O O O N C C C C C C C C C C C C C C C C C C C C C C C C C C H H H H H H H H H H H H H H H H H H H H H
charge: 0
multiplicity: 1
keywords: wb97x-d3
keywords: def2-TZVPP
keywords: def2/J RIJCOSX
keywords: DEFGRID2
keywords: scfconv7
keywords: smallprint printgap noloewdin
keywords: NOSOSCF
formula: C26H21Cl2NO4
InChI: InChI=1/C26H21Cl2NO4/c1-2-31-20-13-11-19(12-14-20)25(17-26(25,27)28)24(30)33-23(16-29)18-7-6-10-22(15-18)32-21-8-4-3-5-9-21/h3-15,23H,2,17H2,1H3
54 atoms
Cl -4.018357 -2.5817 1.007573
Cl -5.337957 -0.166303 0.072952
O  -2.432312 1.34116 0.011424
O  -2.684611 1.100359 -2.208838
O  2.46713 -2.356947 0.605299
O  2.583652 0.850274 -1.279183
N  -2.989601 4.267562 1.45518
C  -2.766045 -0.820341 -0.772927
C  -4.053603 -1.328348 -0.204828
C  -3.692761 -1.660074 -1.60401
C  -1.429623 -1.323979 -0.337763
C  -2.659236 0.640183 -1.10143
C  -0.54603 -1.820393 -1.293328
C  -0.985251 -1.179889 0.970817
C  0.747441 -2.16517 -0.952018
C  0.307704 -1.530778 1.330223
C  -1.724266 2.582401 -0.085374
C  1.187727 -2.016614 0.364256
C  -0.299854 2.315304 0.329917
C  -2.423123 3.525007 0.784689
C  0.560422 1.81305 -0.638204
C  0.117021 2.426658 1.649976
C  2.994073 -2.195899 1.919745
C  1.835748 1.399201 -0.280358
C  1.401251 2.028143 1.989063
C  2.264704 1.504904 1.038551
C  4.44351 -2.611274 1.894046
C  3.952835 0.782982 -1.174581
C  4.716095 1.909598 -0.896688
C  4.553259 -0.441031 -1.425104
C  6.09779 1.795204 -0.854384
C  5.938144 -0.538136 -1.392262
C  6.714057 0.574362 -1.099203
H  -3.3882 -2.67796 -1.811378
H  -4.255074 -1.184627 -2.397857
H  -0.870116 -1.931575 -2.320787
H  -1.644919 -0.784942 1.732151
H  1.428068 -2.543765 -1.704476
H  0.613773 -1.403675 2.359218
H  -1.766168 2.983321 -1.101969
H  0.239407 1.724383 -1.669929
H  -0.544644 2.811456 2.415625
H  2.900074 -1.152898 2.237385
H  2.431217 -2.812055 2.627818
H  1.734379 2.109814 3.014962
H  3.252953 1.180665 1.336375
H  4.864491 -2.505851 2.893707
H  5.028525 -1.986159 1.218097
H  4.558101 -3.652879 1.592779
H  4.243031 2.866868 -0.716213
H  3.945626 -1.306422 -1.655639
H  6.694701 2.670468 -0.634612
H  6.408003 -1.492652 -1.590268
H  7.792362 0.493122 -1.067452
elementType: Cl O N C H
totalener: -2279.54299111 hartree
nucrepener: 3797.34898139 hartree
electener: -6076.89197250 hartree
twoeener: 4600.23560506 hartree
cpcmener: -0.04115638 hartree
kineticenergy: 2272.42551223 hartree
xcener: -173.459557349277 hartree
chargesum: -0.0000000
charge: -0.075735 -0.085423 -0.252538 -0.401280 -0.334811 -0.330649 -0.095193 0.049850 0.146721 -0.122656 0.079219 0.321692 -0.174647 -0.269575 -0.258115 -0.201430 0.387936 0.320260 0.035786 -0.217433 -0.284552 -0.195902 0.033066 0.368066 -0.130631 -0.247503 -0.270355 0.329061 -0.205946 -0.299652 -0.141460 -0.126678 -0.174444 0.110720 0.099933 0.149745 0.148462 0.145198 0.144304 0.142877 0.136878 0.137491 0.100581 0.117488 0.162478 0.158171 0.095748 0.083835 0.090645 0.159086 0.153965 0.162649 0.162960 0.161737
qa: -0.0757 -0.0854 -0.2525 -0.4013 -0.3348 -0.3306 -0.0952 0.0499 0.1467 -0.1227 0.0792 0.3217 -0.1746 -0.2696 -0.2581 -0.2014 0.3879 0.3203 0.0358 -0.2174 -0.2846 -0.1959 0.0331 0.3681 -0.1306 -0.2475 -0.2704 0.3291 -0.2059 -0.2997 -0.1415 -0.1267 -0.1744 0.1107 0.0999 0.1497 0.1485 0.1452 0.1443 0.1429 0.1369 0.1375 0.1006 0.1175 0.1625 0.1582 0.0957 0.0838 0.0906 0.1591 0.1540 0.1626 0.1630 0.1617
va: 1.2311 1.2308 2.1189 2.0984 2.0516 2.0372 3.1058 3.5974 4.2718 3.9839 3.3623 4.2348 3.9883 3.9930 3.9487 3.8427 3.7506 3.7386 3.6664 4.0739 4.0057 3.9500 3.7852 3.5432 3.9167 3.9099 3.9679 3.6081 3.9361 3.9599 3.8761 3.8526 3.8966 1.0251 1.0376 0.9983 1.0217 1.0075 1.0087 1.0231 1.0270 1.0120 0.9804 0.9915 0.9900 0.9926 1.0068 1.0001 1.0046 0.9964 1.0097 0.9885 0.9891 0.9883
dispcorr: -0.038233156 hartree
energy: -2279.581224267813
dipole: 53.62372 -50.44319 3.18053 -4.78674 3.49263 -1.29411 3.14037 -2.72553 0.41484
magnitude: 3.45869 au
magnitude: 8.79130 debye
