program: Orca
programVersion: 5.0.2
elementType: Cl Cl O O O O N C C C C C C C C C C C C C C C C C C C C C C C C C C H H H H H H H H H H H H H H H H H H H H H
charge: 0
multiplicity: 1
keywords: wb97x-d3
keywords: def2-TZVPP
keywords: def2/J RIJCOSX
keywords: DEFGRID2
keywords: scfconv7
keywords: smallprint printgap noloewdin
keywords: NOSOSCF
formula: C26H21Cl2NO4
InChI: InChI=1/C26H21Cl2NO4/c1-2-31-20-13-11-19(12-14-20)25(17-26(25,27)28)24(30)33-23(16-29)18-7-6-10-22(15-18)32-21-8-4-3-5-9-21/h3-15,23H,2,17H2,1H3
54 atoms
Cl -3.578484 -2.96098 0.5047
Cl -5.092141 -0.506947 0.13369
O  -2.347106 1.212459 0.392868
O  -2.582442 1.429534 -1.821933
O  2.797906 -2.442741 0.127624
O  2.68425 1.398649 0.784364
N  -2.303104 3.179958 3.037721
C  -2.491223 -0.760321 -0.843659
C  -3.730167 -1.476528 -0.39881
C  -3.37558 -1.459487 -1.837912
C  -1.123077 -1.274663 -0.537794
C  -2.508383 0.73957 -0.842798
C  -0.247856 -1.559448 -1.58199
C  -0.660607 -1.389035 0.767012
C  1.052904 -1.952461 -1.330751
C  0.6409 -1.786746 1.034632
C  -1.997915 2.590616 0.511376
C  1.511939 -2.069566 -0.017031
C  -0.567557 2.825516 0.087419
C  -2.17836 2.907141 1.927695
C  0.432196 2.00791 0.60157
C  -0.261759 3.823253 -0.824942
C  3.355601 -2.601462 1.430196
C  1.743298 2.199364 0.199666
C  1.060576 4.015373 -1.203467
C  2.069103 3.211843 -0.696543
C  2.973768 -3.915917 2.077316
C  3.72295 0.871423 0.061035
C  3.618328 0.533709 -1.282536
C  4.889916 0.614324 0.768162
C  4.698323 -0.071404 -1.910826
C  5.956872 0.00246 0.127966
C  5.868443 -0.340978 -1.214392
H  -3.005171 -2.379467 -2.27188
H  -3.986688 -0.860381 -2.501484
H  -0.583901 -1.469534 -2.607639
H  -1.313611 -1.165165 1.600552
H  1.723262 -2.166944 -2.153365
H  0.951704 -1.867032 2.066806
H  -2.680881 3.226975 -0.059839
H  0.205567 1.227123 1.317373
H  -1.045278 4.448189 -1.23328
H  4.433502 -2.56427 1.275929
H  3.094849 -1.751264 2.06652
H  1.310285 4.800049 -1.904551
H  3.095875 3.379189 -0.995536
H  3.272434 -4.760207 1.455602
H  1.904912 -3.996837 2.274645
H  3.492182 -4.006507 3.032189
H  2.708664 0.719083 -1.838814
H  4.955108 0.880609 1.81551
H  4.616493 -0.338703 -2.956238
H  6.862725 -0.200128 0.684244
H  6.703566 -0.814536 -1.712826
elementType: Cl O N C H
totalener: -2279.54373195 hartree
nucrepener: 3808.86979261 hartree
electener: -6088.41352457 hartree
twoeener: 4612.24229795 hartree
cpcmener: -0.04245159 hartree
kineticenergy: 2272.42641143 hartree
xcener: -173.460815357760 hartree
chargesum: 0.0000000
charge: -0.075167 -0.086293 -0.256479 -0.407305 -0.341950 -0.338564 -0.095714 0.075288 0.145774 -0.125807 0.085307 0.305433 -0.170499 -0.301872 -0.271145 -0.165853 0.400006 0.311789 0.045189 -0.217842 -0.296548 -0.197654 0.042926 0.271948 -0.117071 -0.199777 -0.267749 0.376371 -0.233998 -0.286523 -0.150465 -0.134737 -0.173934 0.110800 0.100388 0.151730 0.154744 0.140869 0.146371 0.147029 0.164384 0.151857 0.109960 0.092141 0.164256 0.160314 0.089243 0.092456 0.096755 0.152832 0.145065 0.161268 0.160031 0.160421
qa: -0.0752 -0.0863 -0.2565 -0.4073 -0.3420 -0.3386 -0.0957 0.0753 0.1458 -0.1258 0.0853 0.3054 -0.1705 -0.3019 -0.2711 -0.1659 0.4000 0.3118 0.0452 -0.2178 -0.2965 -0.1977 0.0429 0.2719 -0.1171 -0.1998 -0.2677 0.3764 -0.2340 -0.2865 -0.1505 -0.1347 -0.1739 0.1108 0.1004 0.1517 0.1547 0.1409 0.1464 0.1470 0.1644 0.1519 0.1100 0.0921 0.1643 0.1603 0.0892 0.0925 0.0968 0.1528 0.1451 0.1613 0.1600 0.1604
va: 1.2315 1.2298 2.1460 2.0949 2.0368 2.0380 3.1079 3.5995 4.2830 3.9874 3.3044 4.2201 4.0136 3.9755 3.9718 3.8383 3.7416 3.7249 3.6062 4.0857 4.0432 3.9750 3.8285 3.7760 3.8830 3.9400 3.9608 3.4874 3.8673 3.9688 3.8991 3.8440 3.8885 1.0254 1.0374 0.9970 1.0155 1.0117 1.0035 1.0134 1.0053 1.0010 0.9887 0.9901 0.9883 0.9942 1.0049 1.0020 1.0066 1.0014 1.0105 0.9897 0.9887 0.9884
dispcorr: -0.037466104 hartree
energy: -2279.581198057568
dipole: 46.08281 -44.20522 1.87758 -4.56850 4.01155 -0.55695 -3.15444 1.67462 -1.47982
magnitude: 2.45466 au
magnitude: 6.23926 debye
