program: Orca
programVersion: 5.0.2
elementType: Cl Cl F O O O N C C C C C C C C C C C C C C C C C C C C C C H H H H H H H H H H H H H H H H H H
charge: 0
multiplicity: 1
keywords: wb97x-d3
keywords: def2-TZVPP
keywords: def2/J RIJCOSX
keywords: DEFGRID2
keywords: scfconv7
keywords: smallprint printgap noloewdin
keywords: NOSOSCF
formula: C22H18Cl2FNO3
InChI: InChI=1/C22H18Cl2FNO3/c1-22(2)15(11-19(23)24)20(22)21(27)29-18(12-26)13-8-9-16(25)17(10-13)28-14-6-4-3-5-7-14/h3-11,15,18,20H,1-2H3
47 atoms
Cl -2.123794 -0.703644 -1.536324
Cl -4.561922 -1.110342 -0.054072
F  3.999364 -3.07504 0.522199
O  0.937006 2.362732 -0.098103
O  1.194072 2.241387 2.118243
O  1.590126 -2.62476 -0.57777
N  2.879209 3.020898 -2.686102
C  -1.901002 3.379993 0.564881
C  -1.898195 1.963371 0.080651
C  -1.004591 2.363722 1.245373
C  -3.053064 3.885867 1.402023
C  -1.334504 4.446438 -0.342265
C  -3.018179 1.038557 0.306669
C  0.470219 2.321534 1.166731
C  -3.198958 -0.105056 -0.343175
C  2.33631 2.215975 -0.259992
C  2.789355 0.788029 -0.059946
C  2.621783 2.66842 -1.623884
C  1.96948 -0.261706 -0.44632
C  4.029036 0.527526 0.503979
C  2.370042 -1.570857 -0.233904
C  4.454852 -0.778622 0.681842
C  3.617961 -1.816796 0.324796
C  0.388344 -2.80103 0.052122
C  0.007809 -2.106731 1.192956
C  -0.456167 -3.748767 -0.510661
C  -1.236829 -2.359213 1.75307
C  -1.690071 -3.992566 0.06594
C  -2.091318 -3.297052 1.198032
H  -1.37269 1.811215 -0.854275
H  -1.339875 2.062386 2.23099
H  -3.895667 4.164247 0.766985
H  -3.409093 3.156969 2.129321
H  -2.75114 4.772195 1.960899
H  -0.892358 5.256453 0.24041
H  -0.580546 4.075203 -1.031263
H  -2.138728 4.875347 -0.94197
H  -3.763812 1.296893 1.047887
H  2.878016 2.869264 0.432618
H  0.998678 -0.081721 -0.892675
H  4.669475 1.34244 0.815927
H  5.419084 -0.995071 1.121455
H  0.659654 -1.376856 1.654307
H  -0.139862 -4.285133 -1.395529
H  -1.531887 -1.814238 2.640056
H  -2.345855 -4.729369 -0.378453
H  -3.059823 -3.483534 1.640127
totalener: -2149.90869588 hartree
nucrepener: 3163.88938079 hartree
electener: -5313.79807667 hartree
oneelecener: -9240.92766608 hartree
twoeener: 3927.12958941 hartree
kineticenergy: 2143.53742545 hartree
xcener: -159.174085477429 hartree
chargesum: -0.0000000
charge: -0.041262 -0.049656 -0.181574 -0.280575 -0.334675 -0.293405 0.006247 0.079702 0.028633 -0.055934 -0.274343 -0.246183 -0.205353 0.307559 0.074628 0.271513 0.060269 -0.258410 -0.166628 -0.128794 0.150326 -0.157047 0.217076 0.276154 -0.158981 -0.214120 -0.130702 -0.060080 -0.193011 0.091764 0.087609 0.104627 0.075599 0.098429 0.093878 0.097321 0.090789 0.100874 0.128491 0.120111 0.110387 0.127586 0.130579 0.123888 0.124414 0.123539 0.128744
qa: -0.0413 -0.0497 -0.1816 -0.2806 -0.3347 -0.2934 0.0062 0.0797 0.0286 -0.0559 -0.2743 -0.2462 -0.2054 0.3076 0.0746 0.2715 0.0603 -0.2584 -0.1666 -0.1288 0.1503 -0.1570 0.2171 0.2762 -0.1590 -0.2141 -0.1307 -0.0601 -0.1930 0.0918 0.0876 0.1046 0.0756 0.0984 0.0939 0.0973 0.0908 0.1009 0.1285 0.1201 0.1104 0.1276 0.1306 0.1239 0.1244 0.1235 0.1287
va: 1.2945 1.2546 1.1244 2.0859 2.1676 2.1257 3.1150 3.8037 3.7812 3.8038 3.9249 3.9138 3.9361 4.2670 4.2309 3.8528 3.6526 4.0004 3.9796 3.9801 3.7621 3.9199 4.1178 3.7527 3.8629 4.0072 3.8949 3.9179 3.9148 1.0363 1.0280 1.0000 1.0085 1.0037 1.0014 1.0120 1.0030 1.0327 1.0169 1.0262 1.0105 1.0066 1.0122 1.0149 1.0030 0.9990 1.0068
dispcorr: -0.030829286 hartree
energy: -2149.939525165948
dipole: -5.74941 4.79583 -0.95358 22.97015 -22.23687 0.73328 11.20238 -10.08296 1.11942
magnitude: 1.64320 au
magnitude: 4.17669 debye
