program: Orca
programVersion: 5.0.2
elementType: Cl Cl F O O O N C C C C C C C C C C C C C C C C C C C C C C H H H H H H H H H H H H H H H H H H
charge: 0
multiplicity: 1
keywords: wb97x-d3
keywords: def2-TZVPP
keywords: def2/J RIJCOSX
keywords: DEFGRID2
keywords: scfconv7
keywords: smallprint printgap noloewdin
keywords: NOSOSCF
formula: C22H18Cl2FNO3
InChI: InChI=1/C22H18Cl2FNO3/c1-22(2)15(11-19(23)24)20(22)21(27)29-18(12-26)13-8-9-16(25)17(10-13)28-14-6-4-3-5-7-14/h3-11,15,18,20H,1-2H3
47 atoms
Cl -5.494658 2.586816 -1.087572
Cl -5.359074 5.297297 -0.112669
F  4.817087 -2.533912 -1.49242
O  0.27994 1.239184 0.803463
O  -1.089567 0.159644 -0.600049
O  2.996833 -4.03458 -0.257919
N  1.593986 0.475072 3.747552
C  -1.11536 2.956574 -2.062895
C  -2.35917 2.786253 -1.245047
C  -1.001529 2.556588 -0.605005
C  -0.621283 4.342908 -2.402266
C  -0.85087 1.95222 -3.158287
C  -3.173185 3.918531 -0.786607
C  -0.643261 1.189199 -0.179656
C  -4.496674 3.923547 -0.680741
C  0.701345 -0.002001 1.337397
C  1.788657 -0.660972 0.519543
C  1.198066 0.289518 2.685431
C  1.851043 -2.045888 0.489177
C  2.747214 0.093848 -0.140122
C  2.883944 -2.688979 -0.177226
C  3.763649 -0.541633 -0.836451
C  3.831272 -1.919332 -0.842961
C  2.699044 -4.797796 0.84025
C  1.999014 -5.974156 0.623864
C  3.113889 -4.442602 2.117283
C  1.710448 -6.801511 1.698658
C  2.80909 -5.274542 3.183109
C  2.106517 -6.453594 2.98119
H  -2.908406 1.874619 -1.450945
H  -0.640924 3.335111 0.057664
H  0.437096 4.311163 -2.664305
H  -1.16457 4.743272 -3.259363
H  -0.727576 5.052468 -1.582417
H  0.22136 1.835401 -3.3253
H  -1.265331 0.970341 -2.945342
H  -1.293583 2.306275 -4.090314
H  -2.665339 4.828915 -0.493488
H  -0.147045 -0.688508 1.432431
H  1.096423 -2.637558 0.993848
H  2.714279 1.174415 -0.115089
H  4.519018 0.029179 -1.359423
H  1.690051 -6.236031 -0.379439
H  3.671014 -3.529351 2.283757
H  1.165053 -7.720547 1.529575
H  3.130053 -4.997067 4.178362
H  1.873749 -7.098229 3.817685
totalener: -2149.91278743 hartree
nucrepener: 2836.61000738 hartree
electener: -4986.52279481 hartree
oneelecener: -8586.26163370 hartree
twoeener: 3599.73883888 hartree
kineticenergy: 2143.52184137 hartree
xcener: -159.166436623497 hartree
chargesum: 0.0000000
charge: -0.037202 -0.042451 -0.183043 -0.275966 -0.362056 -0.289496 0.000750 0.067707 0.037857 -0.089837 -0.246611 -0.239723 -0.201666 0.331007 0.051481 0.300896 0.060204 -0.248146 -0.149313 -0.168824 0.140905 -0.154349 0.207360 0.227052 -0.202380 -0.152482 -0.092372 -0.116704 -0.140786 0.087426 0.084146 0.093003 0.101163 0.075091 0.085053 0.103348 0.091177 0.097284 0.124781 0.119742 0.127264 0.126180 0.128618 0.136682 0.127509 0.131682 0.128038
qa: -0.0372 -0.0425 -0.1830 -0.2760 -0.3621 -0.2895 0.0008 0.0677 0.0379 -0.0898 -0.2466 -0.2397 -0.2017 0.3310 0.0515 0.3009 0.0602 -0.2481 -0.1493 -0.1688 0.1409 -0.1543 0.2074 0.2271 -0.2024 -0.1525 -0.0924 -0.1167 -0.1408 0.0874 0.0841 0.0930 0.1012 0.0751 0.0851 0.1033 0.0912 0.0973 0.1248 0.1197 0.1273 0.1262 0.1286 0.1367 0.1275 0.1317 0.1280
va: 1.2902 1.2626 1.1206 2.1114 2.1423 2.1185 3.1211 3.7606 3.8421 3.8474 3.9107 3.9129 3.9244 4.2488 4.2570 3.8380 3.6978 4.0047 3.9749 3.9590 3.7991 3.9220 4.0963 3.8073 4.0343 3.9348 3.9363 3.9542 3.9602 1.0507 1.0352 1.0045 1.0024 1.0097 1.0031 1.0203 1.0017 1.0314 1.0234 1.0121 1.0176 1.0073 1.0122 1.0022 0.9986 0.9993 0.9999
dispcorr: -0.023165267 hartree
energy: -2149.935952697414
dipole: 19.21034 -19.12523 0.08511 -10.01564 10.32868 0.31305 -4.32081 3.42697 -0.89384
magnitude: 0.95089 au
magnitude: 2.41696 debye
