program: Orca
programVersion: 5.0.2
elementType: Cl Cl F O O O N C C C C C C C C C C C C C C C C C C C C C C H H H H H H H H H H H H H H H H H H
charge: 0
multiplicity: 1
keywords: wb97x-d3
keywords: def2-TZVPP
keywords: def2/J RIJCOSX
keywords: DEFGRID2
keywords: scfconv7
keywords: smallprint printgap noloewdin
keywords: NOSOSCF
formula: C22H18Cl2FNO3
InChI: InChI=1/C22H18Cl2FNO3/c1-22(2)15(11-19(23)24)20(22)21(27)29-18(12-26)13-8-9-16(25)17(10-13)28-14-6-4-3-5-7-14/h3-11,15,18,20H,1-2H3
47 atoms
Cl -4.453999 3.549217 1.302847
Cl -5.604269 3.65509 -1.340667
F  4.895862 -3.525554 0.1606
O  1.216336 1.369118 -0.870488
O  0.345214 1.813958 1.149481
O  2.568777 -2.995348 1.422719
N  3.771661 3.16906 -1.996451
C  -2.009318 0.125382 -0.081317
C  -2.376801 1.576486 0.019101
C  -1.084131 1.182952 -0.660973
C  -2.709949 -0.759839 -1.083896
C  -1.650788 -0.603953 1.190451
C  -3.455943 2.169522 -0.781376
C  0.194498 1.506578 -0.001158
C  -4.375095 3.01219 -0.325941
C  2.538204 1.538696 -0.371247
C  3.219033 0.192688 -0.251993
C  3.224162 2.447089 -1.290927
C  2.599795 -0.777762 0.528183
C  4.420675 -0.102975 -0.877766
C  3.156707 -2.036244 0.661412
C  4.999961 -1.355084 -0.72661
C  4.362322 -2.315137 0.029359
C  1.321374 -3.428837 1.069891
C  0.879021 -3.452312 -0.246806
C  0.505766 -3.887288 2.095232
C  -0.386289 -3.947515 -0.527637
C  -0.75454 -4.380173 1.797577
C  -1.209769 -4.410395 0.487173
H  -2.2459 2.004762 1.006159
H  -1.055141 1.226616 -1.743913
H  -2.898704 -0.268558 -2.037778
H  -2.105748 -1.645328 -1.284413
H  -3.6701 -1.094703 -0.688297
H  -0.970587 -1.432591 0.985317
H  -1.195142 0.039318 1.939255
H  -2.553966 -1.029313 1.62999
H  -3.519592 1.91127 -1.830995
H  2.507101 2.023218 0.610261
H  1.678295 -0.568853 1.057791
H  4.922598 0.634185 -1.490081
H  5.936848 -1.59154 -1.212341
H  1.511048 -3.1022 -1.052434
H  0.864367 -3.859728 3.115676
H  -0.723304 -3.977146 -1.555785
H  -1.386281 -4.737151 2.599975
H  -2.194279 -4.794949 0.25861
totalener: -2149.91331946 hartree
nucrepener: 2979.67873115 hartree
electener: -5129.59205061 hartree
oneelecener: -8871.93477462 hartree
twoeener: 3742.34272401 hartree
kineticenergy: 2143.52159476 hartree
xcener: -159.170273251984 hartree
chargesum: -0.0000000
charge: -0.037835 -0.043619 -0.181012 -0.260000 -0.366451 -0.293750 0.002225 0.118532 0.031383 -0.070968 -0.254791 -0.236738 -0.207746 0.310046 0.052729 0.386479 -0.091218 -0.286517 -0.086937 -0.134004 0.080616 -0.146679 0.219097 0.189064 -0.079414 -0.155508 -0.204742 -0.113059 -0.116855 0.089032 0.082961 0.075468 0.091805 0.100426 0.027842 0.111822 0.097534 0.097850 0.138387 0.153232 0.132216 0.130378 0.127133 0.129177 0.136647 0.127693 0.128071
qa: -0.0378 -0.0436 -0.1810 -0.2600 -0.3665 -0.2938 0.0022 0.1185 0.0314 -0.0710 -0.2548 -0.2367 -0.2077 0.3100 0.0527 0.3865 -0.0912 -0.2865 -0.0869 -0.1340 0.0806 -0.1467 0.2191 0.1891 -0.0794 -0.1555 -0.2047 -0.1131 -0.1169 0.0890 0.0830 0.0755 0.0918 0.1004 0.0278 0.1118 0.0975 0.0979 0.1384 0.1532 0.1322 0.1304 0.1271 0.1292 0.1366 0.1277 0.1281
va: 1.2898 1.2617 1.1234 2.1156 2.1331 2.1174 3.1162 3.6774 3.8595 3.8656 3.9067 3.9160 3.9249 4.2723 4.2521 3.7514 3.9380 4.0537 3.8888 3.9204 3.8169 3.9263 4.1000 3.8448 3.8064 3.9626 3.9394 3.9551 3.8850 1.0495 1.0356 1.0131 1.0151 1.0025 1.0188 1.0201 1.0079 1.0304 1.0219 1.0084 1.0215 1.0070 1.0104 1.0122 0.9984 0.9991 1.0005
dispcorr: -0.027615346 hartree
energy: -2149.940934803361
dipole: 2.84034 -3.52373 -0.68339 -25.47688 24.00764 -1.46924 -0.07499 0.01525 -0.05974
magnitude: 1.62150 au
magnitude: 4.12153 debye
