program: Orca
programVersion: 5.0.2
elementType: Cl Cl F O O O N C C C C C C C C C C C C C C C C C C C C C C H H H H H H H H H H H H H H H H H H
charge: 0
multiplicity: 1
keywords: wb97x-d3
keywords: def2-TZVPP
keywords: def2/J RIJCOSX
keywords: DEFGRID2
keywords: scfconv7
keywords: smallprint printgap noloewdin
keywords: NOSOSCF
formula: C22H18Cl2FNO3
InChI: InChI=1/C22H18Cl2FNO3/c1-22(2)15(11-19(23)24)20(22)21(27)29-18(12-26)13-8-9-16(25)17(10-13)28-14-6-4-3-5-7-14/h3-11,15,18,20H,1-2H3
47 atoms
Cl -5.408948 2.060081 0.284378
Cl -5.367594 4.840462 -0.483816
F  4.629062 -3.031576 -1.812299
O  1.12297 1.753163 0.190395
O  -0.503991 0.297518 0.691395
O  2.476682 -3.649144 -0.400207
N  3.692256 2.819919 1.97006
C  -1.712076 1.501641 -1.95928
C  -2.445949 2.012723 -0.753097
C  -0.93752 2.112866 -0.807031
C  -1.734996 2.304031 -3.238172
C  -1.689785 0.011338 -2.19573
C  -3.248051 3.244187 -0.796505
C  -0.129905 1.274986 0.102395
C  -4.504834 3.357462 -0.384519
C  2.032558 1.037487 1.024111
C  2.753467 -0.047351 0.262325
C  2.9591 2.043496 1.547771
C  2.271123 -1.350078 0.327616
C  3.858791 0.245604 -0.524552
C  2.901653 -2.366096 -0.375085
C  4.489993 -0.763255 -1.234032
C  4.015728 -2.054486 -1.14899
C  1.843232 -4.181269 0.691256
C  0.663473 -4.873406 0.471756
C  2.38699 -4.087918 1.965366
C  0.024476 -5.484494 1.540217
C  1.731672 -4.693613 3.025742
C  0.551482 -5.393668 2.819333
H  -2.820102 1.238058 -0.093328
H  -0.514599 3.091215 -1.006783
H  -0.894413 2.0254 -3.874916
H  -2.65377 2.108963 -3.793299
H  -1.673851 3.378851 -3.072072
H  -1.76009 -0.567584 -1.278402
H  -2.533735 -0.267481 -2.828467
H  -0.775927 -0.28593 -2.713279
H  -2.79206 4.140547 -1.198364
H  1.501245 0.600331 1.874948
H  1.395461 -1.574216 0.923316
H  4.247761 1.253999 -0.577961
H  5.360311 -0.555732 -1.841601
H  0.258397 -4.936081 -0.529503
H  3.316165 -3.556651 2.128541
H  -0.894629 -6.028897 1.369195
H  2.15451 -4.624239 4.019119
H  0.048255 -5.868004 3.650751
totalener: -2149.91449137 hartree
nucrepener: 2884.39698808 hartree
electener: -5034.31147945 hartree
oneelecener: -8681.88161505 hartree
twoeener: 3647.57013560 hartree
kineticenergy: 2143.52121091 hartree
xcener: -159.166477308358 hartree
chargesum: 0.0000000
charge: -0.038661 -0.042405 -0.182555 -0.252992 -0.386800 -0.286793 -0.001842 0.068141 0.042301 -0.107970 -0.236616 -0.252618 -0.200545 0.370034 0.046703 0.306826 -0.033246 -0.255753 -0.117191 -0.147405 0.141761 -0.152822 0.196973 0.230538 -0.195045 -0.159118 -0.094402 -0.114245 -0.135583 0.089957 0.083540 0.095924 0.099796 0.072403 0.100658 0.091955 0.091455 0.099875 0.124343 0.144184 0.123422 0.128266 0.126804 0.134343 0.127454 0.129675 0.127277
qa: -0.0387 -0.0424 -0.1826 -0.2530 -0.3868 -0.2868 -0.0018 0.0681 0.0423 -0.1080 -0.2366 -0.2526 -0.2005 0.3700 0.0467 0.3068 -0.0332 -0.2558 -0.1172 -0.1474 0.1418 -0.1528 0.1970 0.2305 -0.1950 -0.1591 -0.0944 -0.1142 -0.1356 0.0900 0.0835 0.0959 0.0998 0.0724 0.1007 0.0920 0.0915 0.0999 0.1243 0.1442 0.1234 0.1283 0.1268 0.1343 0.1275 0.1297 0.1273
va: 1.2888 1.2633 1.1208 2.1299 2.1139 2.1192 3.1157 3.7641 3.8177 3.8910 3.9061 3.9155 3.9056 4.2261 4.2478 3.8292 3.7425 4.0227 3.8467 3.9886 3.8092 3.9254 4.0974 3.8156 4.0429 3.9564 3.9388 3.9488 3.9622 1.0476 1.0356 1.0042 1.0032 1.0100 1.0193 1.0026 1.0011 1.0276 1.0178 1.0214 1.0162 1.0075 1.0125 1.0022 0.9989 0.9994 1.0000
dispcorr: -0.023523431 hartree
energy: -2149.938014804666
dipole: 11.11221 -11.59464 -0.48243 -16.13629 15.53393 -0.60236 -5.99988 5.26712 -0.73276
magnitude: 1.06420 au
magnitude: 2.70497 debye
