program: Orca
programVersion: 5.0.2
elementType: Cl Cl F O O O N C C C C C C C C C C C C C C C C C C C C C C H H H H H H H H H H H H H H H H H H
charge: 0
multiplicity: 1
keywords: wb97x-d3
keywords: def2-TZVPP
keywords: def2/J RIJCOSX
keywords: DEFGRID2
keywords: scfconv7
keywords: smallprint printgap noloewdin
keywords: NOSOSCF
formula: C22H18Cl2FNO3
InChI: InChI=1/C22H18Cl2FNO3/c1-22(2)15(11-19(23)24)20(22)21(27)29-18(12-26)13-8-9-16(25)17(10-13)28-14-6-4-3-5-7-14/h3-11,15,18,20H,1-2H3
47 atoms
Cl -5.479381 2.048451 0.133609
Cl -5.376823 4.836098 -0.603977
F  4.547335 -3.148794 -1.782935
O  1.069988 1.68598 0.149331
O  -0.564968 0.236095 0.639499
O  2.424975 -3.747828 -0.313711
N  3.643545 2.747126 1.925786
C  -1.762679 1.435559 -2.016626
C  -2.488719 1.968932 -0.815427
C  -0.979092 2.047102 -0.870541
C  -1.776212 2.226221 -3.30288
C  -1.761929 -0.056954 -2.238984
C  -3.271425 3.212713 -0.870729
C  -0.183175 1.210523 0.05044
C  -4.538032 3.34007 -0.494085
C  1.96844 0.971136 0.995192
C  2.683206 -0.128975 0.249982
C  2.903014 1.974108 1.510328
C  2.213815 -1.433178 0.357569
C  3.771712 0.152997 -0.564228
C  2.841102 -2.461697 -0.330052
C  4.398691 -0.868029 -1.259347
C  3.937572 -2.160912 -1.132429
C  1.836362 -4.261333 0.81121
C  2.423743 -4.13391 2.062793
C  0.65723 -4.970075 0.64892
C  1.813663 -4.724212 3.158272
C  0.063338 -5.56463 1.752142
C  0.634879 -5.441086 3.009248
H  -2.874529 1.206276 -0.148284
H  -0.543831 3.017979 -1.080126
H  -1.703487 3.301768 -3.146474
H  -0.938846 1.932281 -3.936983
H  -2.697134 2.036383 -3.856224
H  -0.853688 -0.371964 -2.755827
H  -1.837917 -0.625903 -1.315934
H  -2.611336 -0.329716 -2.86701
H  -2.791079 4.105768 -1.251356
H  1.429671 0.549378 1.849156
H  1.35013 -1.649415 0.973497
H  4.150277 1.163151 -0.650399
H  5.25565 -0.668896 -1.888303
H  3.35171 -3.588891 2.180945
H  0.217503 -5.058138 -0.335631
H  2.270953 -4.62945 4.134169
H  -0.855341 -6.121768 1.62584
H  0.167254 -5.902814 3.86814
totalener: -2149.91442768 hartree
nucrepener: 2880.32834371 hartree
electener: -5030.24277139 hartree
oneelecener: -8673.74959656 hartree
twoeener: 3643.50682517 hartree
kineticenergy: 2143.52064886 hartree
xcener: -159.166096767218 hartree
chargesum: -0.0000000
charge: -0.038582 -0.042231 -0.182515 -0.253607 -0.386609 -0.287165 -0.001660 0.069744 0.039922 -0.111144 -0.234735 -0.252534 -0.199043 0.370451 0.045109 0.307242 -0.033576 -0.256346 -0.107573 -0.147677 0.136487 -0.153936 0.199130 0.226658 -0.155561 -0.193796 -0.115695 -0.094927 -0.135249 0.090877 0.083467 0.072302 0.095951 0.099536 0.091418 0.100806 0.091785 0.100775 0.123760 0.141108 0.123481 0.128319 0.134347 0.127085 0.129695 0.127389 0.127315
qa: -0.0386 -0.0422 -0.1825 -0.2536 -0.3866 -0.2872 -0.0017 0.0697 0.0399 -0.1111 -0.2347 -0.2525 -0.1990 0.3705 0.0451 0.3072 -0.0336 -0.2563 -0.1076 -0.1477 0.1365 -0.1539 0.1991 0.2267 -0.1556 -0.1938 -0.1157 -0.0949 -0.1352 0.0909 0.0835 0.0723 0.0960 0.0995 0.0914 0.1008 0.0918 0.1008 0.1238 0.1411 0.1235 0.1283 0.1343 0.1271 0.1297 0.1274 0.1273
va: 1.2888 1.2636 1.1209 2.1310 2.1142 2.1183 3.1160 3.7628 3.8176 3.8962 3.9055 3.9151 3.9011 4.2234 4.2469 3.8308 3.7342 4.0228 3.8473 3.9887 3.8107 3.9247 4.0971 3.8190 3.9549 4.0415 3.9499 3.9396 3.9612 1.0465 1.0359 1.0098 1.0043 1.0034 1.0011 1.0195 1.0026 1.0268 1.0179 1.0225 1.0157 1.0074 1.0022 1.0125 0.9995 0.9989 1.0000
dispcorr: -0.023490584 hartree
energy: -2149.937918260279
dipole: 11.34673 -11.81816 -0.47143 -16.31733 15.72160 -0.59573 -5.27399 4.56763 -0.70636
magnitude: 1.03735 au
magnitude: 2.63672 debye
