program: Orca
programVersion: 5.0.2
elementType: Cl Cl F O O O N C C C C C C C C C C C C C C C C C C C C C C H H H H H H H H H H H H H H H H H H
charge: 0
multiplicity: 1
keywords: wb97x-d3
keywords: def2-TZVPP
keywords: def2/J RIJCOSX
keywords: DEFGRID2
keywords: scfconv7
keywords: smallprint printgap noloewdin
keywords: NOSOSCF
formula: C22H18Cl2FNO3
InChI: InChI=1/C22H18Cl2FNO3/c1-22(2)15(11-19(23)24)20(22)21(27)29-18(12-26)13-8-9-16(25)17(10-13)28-14-6-4-3-5-7-14/h3-11,15,18,20H,1-2H3
47 atoms
Cl -4.503021 4.181408 1.554967
Cl -4.292415 6.456518 -0.207317
F  1.347186 -4.60449 -1.40834
O  0.928909 1.595956 -0.523535
O  -0.706103 0.870347 0.819991
O  1.338436 -3.987051 1.243436
N  4.22977 1.639416 -0.423229
C  -2.434654 1.817011 -1.660968
C  -2.586421 2.768968 -0.510605
C  -1.201076 2.378006 -0.97907
C  -2.6803 2.292186 -3.073676
C  -2.840187 0.37898 -1.443445
C  -3.029648 4.156245 -0.698843
C  -0.353634 1.535862 -0.112535
C  -3.833082 4.831474 0.113822
C  1.84223 0.748153 0.155566
C  1.704295 -0.693425 -0.27093
C  3.173763 1.260271 -0.178021
C  1.597337 -1.691303 0.686196
C  1.697903 -1.024147 -1.619541
C  1.485344 -3.017799 0.306074
C  1.57284 -2.347031 -2.010798
C  1.466197 -3.330034 -1.047886
C  2.357547 -4.881275 1.435842
C  2.029956 -6.04463 2.118686
C  3.660449 -4.6508 1.018717
C  3.014819 -6.980148 2.382924
C  4.63496 -5.602377 1.286793
C  4.322241 -6.767517 1.966723
H  -2.889073 2.30448 0.420844
H  -0.652553 3.113486 -1.556954
H  -2.190548 1.624986 -3.78439
H  -3.747908 2.291891 -3.298629
H  -2.302464 3.295972 -3.263642
H  -2.235363 -0.292142 -2.056584
H  -2.74734 0.06061 -0.408134
H  -3.88213 0.246721 -1.738735
H  -2.675016 4.690143 -1.571719
H  1.711086 0.826158 1.240131
H  1.586876 -1.450412 1.741865
H  1.790748 -0.253897 -2.374281
H  1.559847 -2.620828 -3.057073
H  1.007988 -6.20692 2.434473
H  3.930615 -3.74159 0.497468
H  2.755678 -7.886217 2.914425
H  5.650317 -5.420877 0.960128
H  5.087817 -7.503036 2.171705
totalener: -2149.91327117 hartree
nucrepener: 2842.83906866 hartree
electener: -4992.75233983 hartree
oneelecener: -8598.68571367 hartree
twoeener: 3605.93337384 hartree
kineticenergy: 2143.52995381 hartree
xcener: -159.166230677944 hartree
chargesum: -0.0000000
charge: -0.037066 -0.043357 -0.183091 -0.264278 -0.359399 -0.297432 0.002037 0.065145 0.045153 -0.079490 -0.248129 -0.241127 -0.204843 0.322940 0.050117 0.313704 0.022027 -0.254547 -0.111841 -0.167492 0.085315 -0.155863 0.260881 0.265410 -0.205183 -0.140162 -0.094642 -0.141945 -0.139919 0.087346 0.082592 0.093352 0.101567 0.075185 0.085055 0.102541 0.092480 0.096860 0.120996 0.112901 0.129862 0.130057 0.123943 0.125641 0.124723 0.126930 0.125047
qa: -0.0371 -0.0434 -0.1831 -0.2643 -0.3594 -0.2974 0.0020 0.0651 0.0452 -0.0795 -0.2481 -0.2411 -0.2048 0.3229 0.0501 0.3137 0.0220 -0.2545 -0.1118 -0.1675 0.0853 -0.1559 0.2609 0.2654 -0.2052 -0.1402 -0.0946 -0.1419 -0.1399 0.0873 0.0826 0.0934 0.1016 0.0752 0.0851 0.1025 0.0925 0.0969 0.1210 0.1129 0.1299 0.1301 0.1239 0.1256 0.1247 0.1269 0.1250
va: 1.2904 1.2614 1.1193 2.1227 2.1477 2.1073 3.1178 3.7724 3.8376 3.8361 3.9088 3.9133 3.9210 4.2775 4.2556 3.8340 3.6318 4.0235 4.0095 3.9666 3.8927 3.9316 4.0515 3.7740 4.0279 3.9055 3.9540 3.9902 3.9591 1.0496 1.0350 1.0041 1.0025 1.0102 1.0030 1.0193 1.0023 1.0316 1.0188 1.0233 1.0168 1.0063 1.0144 1.0115 0.9987 1.0006 1.0001
dispcorr: -0.023661450 hartree
energy: -2149.936932619346
dipole: 12.64766 -13.27355 -0.62590 -25.06051 24.53478 -0.52573 -10.64973 9.79918 -0.85055
magnitude: 1.17965 au
magnitude: 2.99843 debye
