program: Orca
programVersion: 5.0.2
elementType: Cl Cl F O O O N C C C C C C C C C C C C C C C C C C C C C C H H H H H H H H H H H H H H H H H H
charge: 0
multiplicity: 1
keywords: wb97x-d3
keywords: def2-TZVPP
keywords: def2/J RIJCOSX
keywords: DEFGRID2
keywords: scfconv7
keywords: smallprint printgap noloewdin
keywords: NOSOSCF
formula: C22H18Cl2FNO3
InChI: InChI=1/C22H18Cl2FNO3/c1-22(2)15(11-19(23)24)20(22)21(27)29-18(12-26)13-8-9-16(25)17(10-13)28-14-6-4-3-5-7-14/h3-11,15,18,20H,1-2H3
47 atoms
Cl -2.999458 5.654184 -1.093456
Cl -5.546111 4.331882 -1.384312
F  4.559144 -1.841154 2.806775
O  0.184722 0.152333 -1.110631
O  0.815941 2.244205 -0.621431
O  2.816195 -3.531438 1.776517
N  1.27975 -1.965053 -3.413708
C  -1.674606 2.101265 1.27693
C  -2.01511 2.88424 0.043062
C  -1.397167 1.505921 -0.090715
C  -2.774093 1.43941 2.073315
C  -0.545773 2.604618 2.143886
C  -3.40109 3.083398 -0.399586
C  -0.023562 1.385857 -0.618035
C  -3.903513 4.208635 -0.892867
C  1.507244 -0.139711 -1.558574
C  2.367328 -0.611738 -0.414443
C  1.362839 -1.163754 -2.595253
C  2.173792 -1.886699 0.112838
C  3.299419 0.243528 0.146762
C  2.9178 -2.313762 1.199414
C  4.045638 -0.175576 1.240626
C  3.849784 -1.435372 1.755698
C  1.929772 -4.432986 1.236624
C  0.637504 -4.494019 1.732466
C  2.347491 -5.277117 0.219822
C  -0.248931 -5.418226 1.199777
C  1.452227 -6.197215 -0.305087
C  0.154272 -6.267888 0.179889
H  -1.334612 3.699594 -0.17383
H  -2.059766 0.699664 -0.384594
H  -2.36332 0.635164 2.685086
H  -3.247201 2.159363 2.742708
H  -3.555225 1.004582 1.451191
H  0.20834 3.154325 1.587358
H  -0.947266 3.271797 2.908034
H  -0.051129 1.776728 2.654923
H  -4.084572 2.246543 -0.328775
H  1.957798 0.743044 -2.021892
H  1.447627 -2.553116 -0.336366
H  3.441264 1.238759 -0.250572
H  4.779034 0.475131 1.697247
H  0.333394 -3.827833 2.529404
H  3.361423 -5.213948 -0.153663
H  -1.259091 -5.471232 1.583433
H  1.77159 -6.858155 -1.099801
H  -0.540784 -6.984765 -0.235777
totalener: -2149.91446460 hartree
nucrepener: 2886.63225707 hartree
electener: -5036.54672168 hartree
oneelecener: -8686.47786198 hartree
twoeener: 3649.93114030 hartree
kineticenergy: 2143.51995656 hartree
xcener: -159.165602789605 hartree
chargesum: -0.0000000
charge: -0.038055 -0.043709 -0.184398 -0.259526 -0.383527 -0.285806 -0.001629 0.062306 0.046340 -0.091243 -0.244937 -0.247150 -0.203545 0.361016 0.050284 0.322570 -0.043954 -0.267455 -0.153585 -0.126803 0.176404 -0.139822 0.189835 0.181667 -0.144867 -0.132228 -0.128424 -0.121542 -0.107326 0.087743 0.081766 0.094013 0.100473 0.073921 0.101954 0.091395 0.088811 0.096663 0.122473 0.127392 0.122483 0.126643 0.126010 0.129902 0.128235 0.129948 0.129284
qa: -0.0381 -0.0437 -0.1844 -0.2595 -0.3835 -0.2858 -0.0016 0.0623 0.0463 -0.0912 -0.2449 -0.2472 -0.2035 0.3610 0.0503 0.3226 -0.0440 -0.2675 -0.1536 -0.1268 0.1764 -0.1398 0.1898 0.1817 -0.1449 -0.1322 -0.1284 -0.1215 -0.1073 0.0877 0.0818 0.0940 0.1005 0.0739 0.1020 0.0914 0.0888 0.0967 0.1225 0.1274 0.1225 0.1266 0.1260 0.1299 0.1282 0.1299 0.1293
va: 1.2896 1.2615 1.1168 2.1348 2.1181 2.1191 3.1165 3.7640 3.8271 3.8694 3.9095 3.9132 3.9176 4.2344 4.2532 3.8299 3.7682 4.0331 3.9627 3.9278 3.7742 3.9204 4.0932 3.8654 3.9943 3.9997 3.9509 3.9588 3.9376 1.0489 1.0355 1.0040 1.0028 1.0102 1.0208 1.0019 1.0015 1.0311 1.0188 1.0210 1.0204 1.0070 1.0080 1.0063 0.9998 0.9998 0.9996
dispcorr: -0.023729042 hartree
energy: -2149.938193642754
dipole: 5.13508 -5.62746 -0.49238 -21.50578 21.29925 -0.20654 13.85506 -12.78748 1.06759
magnitude: 1.19367 au
magnitude: 3.03406 debye
