program: Orca
programVersion: 5.0.2
elementType: Cl Cl F O O O N C C C C C C C C C C C C C C C C C C C C C C H H H H H H H H H H H H H H H H H H
charge: 0
multiplicity: 1
keywords: wb97x-d3
keywords: def2-TZVPP
keywords: def2/J RIJCOSX
keywords: DEFGRID2
keywords: scfconv7
keywords: smallprint printgap noloewdin
keywords: NOSOSCF
formula: C22H18Cl2FNO3
InChI: InChI=1/C22H18Cl2FNO3/c1-22(2)15(11-19(23)24)20(22)21(27)29-18(12-26)13-8-9-16(25)17(10-13)28-14-6-4-3-5-7-14/h3-11,15,18,20H,1-2H3
47 atoms
Cl -1.73947 -0.502084 -2.441439
Cl -4.391689 -1.073999 -1.460971
F  3.33515 -3.137637 -1.340226
O  0.922642 2.248041 0.343882
O  0.42555 2.023817 2.518887
O  1.985698 -2.841259 0.941721
N  3.589436 3.96948 -0.582222
C  -1.941421 3.319452 0.037078
C  -1.809989 1.896329 -0.416111
C  -1.345696 2.293172 0.977539
C  -3.294509 3.857445 0.442754
C  -1.086155 4.363303 -0.641552
C  -2.95319 0.987502 -0.552287
C  0.071175 2.18559 1.384349
C  -3.013706 -0.048319 -1.380455
C  2.308554 2.017044 0.587059
C  2.677199 0.650568 0.06269
C  3.028883 3.107109 -0.071787
C  2.200918 -0.450751 0.767391
C  3.40075 0.461651 -1.104473
C  2.412603 -1.733729 0.292701
C  3.642511 -0.822856 -1.571058
C  3.136804 -1.904499 -0.883423
C  0.704143 -2.882467 1.424679
C  0.507722 -3.542316 2.627645
C  -0.367962 -2.339019 0.728887
C  -0.776084 -3.661343 3.136532
C  -1.645511 -2.461459 1.253418
C  -1.856312 -3.120447 2.455523
H  -1.008363 1.725152 -1.123848
H  -1.994933 2.006035 1.796751
H  -3.873757 4.141299 -0.437163
H  -3.887431 3.146971 1.017671
H  -3.173387 4.746548 1.062625
H  -0.8405 5.171304 0.049349
H  -0.156209 3.969861 -1.042312
H  -1.641603 4.799453 -1.473089
H  -3.821309 1.153063 0.073408
H  2.515965 2.078232 1.659864
H  1.652564 -0.316803 1.692594
H  3.784595 1.305684 -1.662037
H  4.205548 -0.984785 -2.480144
H  1.355918 -3.961674 3.152326
H  -0.220418 -1.836801 -0.218582
H  -0.928894 -4.179183 4.07405
H  -2.483045 -2.051061 0.705223
H  -2.856166 -3.214942 2.856533
totalener: -2149.91094516 hartree
nucrepener: 3106.44780302 hartree
electener: -5256.35874818 hartree
oneelecener: -9125.60476233 hartree
twoeener: 3869.24601415 hartree
kineticenergy: 2143.52123939 hartree
xcener: -159.168517202407 hartree
chargesum: -0.0000000
charge: -0.045944 -0.048141 -0.181139 -0.263976 -0.348325 -0.291971 0.001695 0.064266 0.075967 -0.084199 -0.260950 -0.237822 -0.221181 0.349974 0.052358 0.317782 -0.035406 -0.283800 -0.126918 -0.147165 0.120642 -0.145888 0.199874 0.238170 -0.214890 -0.159732 -0.076188 -0.086388 -0.164627 0.083577 0.086941 0.101899 0.075540 0.098005 0.095553 0.092961 0.089582 0.100330 0.136973 0.156113 0.128861 0.129120 0.126766 0.120182 0.126081 0.131092 0.124346
qa: -0.0459 -0.0481 -0.1811 -0.2640 -0.3483 -0.2920 0.0017 0.0643 0.0760 -0.0842 -0.2610 -0.2378 -0.2212 0.3500 0.0524 0.3178 -0.0354 -0.2838 -0.1269 -0.1472 0.1206 -0.1459 0.1999 0.2382 -0.2149 -0.1597 -0.0762 -0.0864 -0.1646 0.0836 0.0869 0.1019 0.0755 0.0980 0.0956 0.0930 0.0896 0.1003 0.1370 0.1561 0.1289 0.1291 0.1268 0.1202 0.1261 0.1311 0.1243
va: 1.2769 1.2515 1.1234 2.0849 2.1571 2.1232 3.1122 3.7895 3.7355 3.8391 3.9204 3.9152 3.9292 4.2589 4.2139 3.8152 3.8247 4.0282 3.8727 3.9480 3.8169 3.9340 4.1074 3.8624 4.0443 3.9229 3.9287 3.8942 4.0123 1.0490 1.0302 1.0010 1.0098 1.0035 1.0027 1.0147 1.0022 1.0323 1.0234 1.0122 1.0201 1.0070 1.0131 1.0212 0.9981 1.0069 1.0017
dispcorr: -0.028253608 hartree
energy: -2149.939198771777
dipole: -6.85121 5.56243 -1.28878 21.45710 -21.23185 0.22525 15.22267 -14.99309 0.22959
magnitude: 1.32831 au
magnitude: 3.37629 debye
