program: Orca
programVersion: 5.0.2
elementType: Cl Cl F O O O N C C C C C C C C C C C C C C C C C C C C C C H H H H H H H H H H H H H H H H H H
charge: 0
multiplicity: 1
keywords: wb97x-d3
keywords: def2-TZVPP
keywords: def2/J RIJCOSX
keywords: DEFGRID2
keywords: scfconv7
keywords: smallprint printgap noloewdin
keywords: NOSOSCF
formula: C22H18Cl2FNO3
InChI: InChI=1/C22H18Cl2FNO3/c1-22(2)15(11-19(23)24)20(22)21(27)29-18(12-26)13-8-9-16(25)17(10-13)28-14-6-4-3-5-7-14/h3-11,15,18,20H,1-2H3
47 atoms
Cl -5.040136 2.36307 1.124683
Cl -5.428228 4.661564 -0.576128
F  4.000526 -3.566204 -0.784415
O  1.313065 2.060055 -0.509933
O  0.014328 1.00597 0.975752
O  2.870251 -2.954684 1.61987
N  4.299821 3.448911 -0.405286
C  -1.932979 0.971109 -1.508668
C  -2.384255 1.957633 -0.471765
C  -0.958611 2.003328 -0.969882
C  -2.361862 1.155268 -2.94472
C  -1.818176 -0.478234 -1.103962
C  -3.290565 3.071503 -0.789276
C  0.129791 1.621233 -0.048603
C  -4.431638 3.325467 -0.16057
C  2.463139 1.713715 0.258837
C  2.910462 0.300449 -0.018265
C  3.486567 2.690489 -0.119105
C  2.679257 -0.691543 0.926531
C  3.498584 -0.027466 -1.232941
C  3.048272 -2.000541 0.672076
C  3.867605 -1.335671 -1.499103
C  3.643392 -2.307892 -0.546278
C  1.987025 -3.971621 1.370905
C  2.203862 -5.160205 2.052553
C  0.900657 -3.831923 0.51939
C  1.328462 -6.217505 1.873168
C  0.035842 -4.903432 0.346043
C  0.242857 -6.097805 1.016633
H  -2.49607 1.541055 0.52308
H  -0.700453 2.795764 -1.663772
H  -1.684182 0.623871 -3.614233
H  -3.364907 0.754117 -3.096801
H  -2.3751 2.198902 -3.256491
H  -1.058046 -0.986544 -1.701046
H  -1.56759 -0.609818 -0.054181
H  -2.769187 -0.982288 -1.282147
H  -3.016828 3.749027 -1.588753
H  2.260859 1.83666 1.327489
H  2.204051 -0.459592 1.870633
H  3.688737 0.736717 -1.975793
H  4.339723 -1.603327 -2.434642
H  3.056315 -5.249199 2.712769
H  0.715513 -2.899859 0.000426
H  1.501875 -7.144773 2.402938
H  -0.811168 -4.794698 -0.318485
H  -0.435924 -6.927729 0.875823
totalener: -2149.91379310 hartree
nucrepener: 2907.03345778 hartree
electener: -5056.94725089 hartree
oneelecener: -8726.97465133 hartree
twoeener: 3670.02740045 hartree
kineticenergy: 2143.53514983 hartree
xcener: -159.167034174201 hartree
chargesum: -0.0000000
charge: -0.037504 -0.040811 -0.183304 -0.253080 -0.381806 -0.298584 0.000785 0.082229 0.035455 -0.112375 -0.233884 -0.265415 -0.201093 0.363240 0.045859 0.311407 -0.031314 -0.259912 -0.109946 -0.128483 0.085661 -0.165010 0.271221 0.231438 -0.183313 -0.114300 -0.103636 -0.147190 -0.129383 0.093596 0.084384 0.094880 0.100166 0.072771 0.086909 0.102983 0.095509 0.102325 0.123588 0.122904 0.126259 0.130387 0.123999 0.120443 0.124697 0.122048 0.125198
qa: -0.0375 -0.0408 -0.1833 -0.2531 -0.3818 -0.2986 0.0008 0.0822 0.0355 -0.1124 -0.2339 -0.2654 -0.2011 0.3632 0.0459 0.3114 -0.0313 -0.2599 -0.1099 -0.1285 0.0857 -0.1650 0.2712 0.2314 -0.1833 -0.1143 -0.1036 -0.1472 -0.1294 0.0936 0.0844 0.0949 0.1002 0.0728 0.0869 0.1030 0.0955 0.1023 0.1236 0.1229 0.1263 0.1304 0.1240 0.1204 0.1247 0.1220 0.1252
va: 1.2897 1.2651 1.1183 2.1390 2.1210 2.1055 3.1160 3.7527 3.8212 3.9020 3.9041 3.9134 3.9016 4.2294 4.2495 3.8359 3.6456 4.0230 3.9654 3.9800 3.9017 3.9461 4.0415 3.8055 4.0198 3.8970 3.9642 3.9879 3.9532 1.0456 1.0360 1.0046 1.0036 1.0096 0.9998 1.0178 1.0036 1.0257 1.0146 1.0304 1.0141 1.0070 1.0141 1.0067 0.9990 1.0018 0.9999
dispcorr: -0.024538555 hartree
energy: -2149.938331658452
dipole: 7.67818 -8.47218 -0.79400 -22.29669 21.39164 -0.90505 -10.32158 9.46218 -0.85940
magnitude: 1.47923 au
magnitude: 3.75989 debye
