program: Orca
programVersion: 5.0.2
elementType: Cl Cl F O O O N C C C C C C C C C C C C C C C C C C C C C C H H H H H H H H H H H H H H H H H H
charge: 0
multiplicity: 1
keywords: wb97x-d3
keywords: def2-TZVPP
keywords: def2/J RIJCOSX
keywords: DEFGRID2
keywords: scfconv7
keywords: smallprint printgap noloewdin
keywords: NOSOSCF
formula: C22H18Cl2FNO3
InChI: InChI=1/C22H18Cl2FNO3/c1-22(2)15(11-19(23)24)20(22)21(27)29-18(12-26)13-8-9-16(25)17(10-13)28-14-6-4-3-5-7-14/h3-11,15,18,20H,1-2H3
47 atoms
Cl -4.533767 4.107988 1.476561
Cl -4.267031 6.312084 -0.366539
F  2.36643 -4.494451 -1.528259
O  0.895401 1.492241 -0.51181
O  -0.717119 0.696216 0.820472
O  1.077995 -3.986888 0.827445
N  4.086597 2.148405 -0.023326
C  -2.563588 1.549868 -1.576047
C  -2.616561 2.58993 -0.497246
C  -1.272726 2.122403 -1.023597
C  -2.891605 1.929985 -3.000331
C  -3.002102 0.148789 -1.226897
C  -3.035649 3.973631 -0.755351
C  -0.386664 1.353662 -0.128013
C  -3.837352 4.693883 0.019749
C  1.87138 0.790342 0.25134
C  2.030854 -0.631686 -0.224179
C  3.110047 1.555567 0.093537
C  1.519595 -1.67336 0.539232
C  2.654347 -0.905404 -1.434951
C  1.631739 -2.982711 0.103131
C  2.769728 -2.211149 -1.881044
C  2.257655 -3.236276 -1.1120
C  1.887749 -4.915494 1.423213
C  3.24395 -4.718955 1.637984
C  1.266407 -6.081695 1.849357
C  3.977788 -5.710044 2.275477
C  2.011724 -7.057282 2.487755
C  3.372046 -6.880369 2.701361
H  -2.867008 2.204026 0.484245
H  -0.750369 2.800071 -1.68951
H  -2.463275 1.203075 -3.69172
H  -3.971732 1.93951 -3.153186
H  -2.508897 2.909464 -3.284304
H  -2.471994 -0.586612 -1.834552
H  -2.841988 -0.102188 -0.181684
H  -4.067718 0.042219 -1.435378
H  -2.662463 4.463231 -1.646257
H  1.605363 0.798262 1.312903
H  1.01348 -1.478623 1.476065
H  3.063426 -0.103042 -2.035549
H  3.253737 -2.439079 -2.820978
H  3.734757 -3.806465 1.3251
H  0.206784 -6.215046 1.676151
H  5.036004 -5.556435 2.440323
H  1.524526 -7.96559 2.816722
H  3.951899 -7.646943 3.19666
totalener: -2149.91453554 hartree
nucrepener: 2837.63304294 hartree
electener: -4987.54757849 hartree
oneelecener: -8588.33515035 hartree
twoeener: 3600.78757186 hartree
kineticenergy: 2143.52779774 hartree
xcener: -159.166235420433 hartree
chargesum: -0.0000000
charge: -0.038232 -0.042137 -0.182466 -0.257739 -0.384198 -0.295592 -0.000176 0.064421 0.042818 -0.101218 -0.241442 -0.245753 -0.201626 0.370077 0.049716 0.314711 -0.036464 -0.259014 -0.088790 -0.128143 0.073419 -0.164901 0.261688 0.271435 -0.142212 -0.209633 -0.138526 -0.092304 -0.142892 0.088836 0.082499 0.095008 0.099925 0.072984 0.089104 0.102237 0.090949 0.098105 0.121651 0.123358 0.126854 0.130967 0.123565 0.123263 0.126135 0.124680 0.125054
qa: -0.0382 -0.0421 -0.1825 -0.2577 -0.3842 -0.2956 -0.0002 0.0644 0.0428 -0.1012 -0.2414 -0.2458 -0.2016 0.3701 0.0497 0.3147 -0.0365 -0.2590 -0.0888 -0.1281 0.0734 -0.1649 0.2617 0.2714 -0.1422 -0.2096 -0.1385 -0.0923 -0.1429 0.0888 0.0825 0.0950 0.0999 0.0730 0.0891 0.1022 0.0909 0.0981 0.1217 0.1234 0.1269 0.1310 0.1236 0.1233 0.1261 0.1247 0.1251
va: 1.2888 1.2631 1.1201 2.1340 2.1198 2.1098 3.1158 3.7559 3.8272 3.8783 3.9092 3.9144 3.9189 4.2198 4.2524 3.8322 3.6656 4.0227 3.9590 3.9816 3.8974 3.9429 4.0455 3.7754 3.9114 4.0306 3.9892 3.9528 3.9628 1.0486 1.0359 1.0041 1.0030 1.0102 1.0018 1.0202 1.0017 1.0301 1.0170 1.0302 1.0138 1.0070 1.0119 1.0146 1.0007 0.9987 1.0003
dispcorr: -0.023172328 hartree
energy: -2149.937707868680
dipole: 9.22038 -9.75788 -0.53750 -26.62862 25.86328 -0.76534 -7.50566 6.69990 -0.80575
magnitude: 1.23446 au
magnitude: 3.13775 debye
