program: Orca
programVersion: 5.0.2
elementType: Cl Cl F O O O N C C C C C C C C C C C C C C C C C C C C C C H H H H H H H H H H H H H H H H H H
charge: 0
multiplicity: 1
keywords: wb97x-d3
keywords: def2-TZVPP
keywords: def2/J RIJCOSX
keywords: DEFGRID2
keywords: scfconv7
keywords: smallprint printgap noloewdin
keywords: NOSOSCF
formula: C22H18Cl2FNO3
InChI: InChI=1/C22H18Cl2FNO3/c1-22(2)15(11-19(23)24)20(22)21(27)29-18(12-26)13-8-9-16(25)17(10-13)28-14-6-4-3-5-7-14/h3-11,15,18,20H,1-2H3
47 atoms
Cl -3.022706 5.695498 -1.204755
Cl -5.529336 4.30871 -1.547374
F  4.818418 -1.953771 2.594664
O  0.180173 0.172641 -1.016078
O  0.847506 2.264546 -0.576254
O  2.899604 -3.545794 1.768263
N  1.159588 -1.96561 -3.349314
C  -1.680076 2.268234 1.277626
C  -2.002261 2.962435 -0.012698
C  -1.382338 1.577607 -0.039074
C  -2.794051 1.666292 2.100889
C  -0.566015 2.832869 2.12492
C  -3.381611 3.124275 -0.491364
C  -0.007091 1.421417 -0.553198
C  -3.898498 4.231596 -1.009716
C  1.481027 -0.138744 -1.508304
C  2.388012 -0.624981 -0.407052
C  1.284557 -1.161481 -2.538814
C  2.184342 -1.886696 0.147701
C  3.395776 0.194507 0.070094
C  3.005633 -2.342612 1.164066
C  4.22041 -0.253558 1.094235
C  4.024863 -1.507237 1.623859
C  2.007887 -4.460672 1.263986
C  0.826321 -4.686406 1.949145
C  2.309859 -5.1625 0.106815
C  -0.064861 -5.634963 1.468382
C  1.408266 -6.102042 -0.368002
C  0.220744 -6.340251 0.309353
H  -1.319732 3.762712 -0.275098
H  -2.044314 0.75546 -0.28605
H  -2.396522 0.90489 2.773276
H  -3.27373 2.432852 2.711301
H  -3.568162 1.193127 1.498315
H  -0.089582 2.045666 2.711923
H  0.204765 3.329808 1.542332
H  -0.977933 3.562369 2.823983
H  -4.046086 2.27147 -0.42836
H  1.925824 0.737174 -1.99008
H  1.391624 -2.52177 -0.228351
H  3.542415 1.182152 -0.344796
H  5.018305 0.366746 1.479527
H  0.613986 -4.130078 2.85262
H  3.239459 -4.975581 -0.415182
H  -0.987704 -5.818594 2.002164
H  1.637117 -6.649978 -1.272033
H  -0.478667 -7.075207 -0.065137
totalener: -2149.91471417 hartree
nucrepener: 2872.98532705 hartree
electener: -5022.90004122 hartree
oneelecener: -8659.21289593 hartree
twoeener: 3636.31285471 hartree
kineticenergy: 2143.52474750 hartree
xcener: -159.166543351837 hartree
chargesum: -0.0000000
charge: -0.038335 -0.043112 -0.184050 -0.261801 -0.383895 -0.284461 -0.003331 0.063809 0.045785 -0.100715 -0.239447 -0.246825 -0.201278 0.364675 0.047698 0.326103 -0.043966 -0.265383 -0.156871 -0.117701 0.171664 -0.144147 0.191676 0.196895 -0.156102 -0.145713 -0.121649 -0.115053 -0.114632 0.088468 0.081881 0.094083 0.099652 0.073272 0.088802 0.102554 0.090462 0.097689 0.120855 0.128506 0.121662 0.126473 0.125945 0.132569 0.127746 0.130471 0.129076
qa: -0.0383 -0.0431 -0.1841 -0.2618 -0.3839 -0.2845 -0.0033 0.0638 0.0458 -0.1007 -0.2394 -0.2468 -0.2013 0.3647 0.0477 0.3261 -0.0440 -0.2654 -0.1569 -0.1177 0.1717 -0.1441 0.1917 0.1969 -0.1561 -0.1457 -0.1216 -0.1151 -0.1146 0.0885 0.0819 0.0941 0.0997 0.0733 0.0888 0.1026 0.0905 0.0977 0.1209 0.1285 0.1217 0.1265 0.1259 0.1326 0.1277 0.1305 0.1291
va: 1.2891 1.2622 1.1175 2.1353 2.1186 2.1196 3.1160 3.7607 3.8263 3.8808 3.9092 3.9136 3.9124 4.2271 4.2520 3.8285 3.7621 4.0288 3.9577 3.9283 3.7800 3.9264 4.0873 3.8426 4.0147 3.9901 3.9458 3.9543 3.9404 1.0480 1.0363 1.0042 1.0032 1.0101 1.0018 1.0209 1.0016 1.0300 1.0200 1.0200 1.0191 1.0072 1.0095 1.0044 0.9996 0.9997 0.9996
dispcorr: -0.023467676 hartree
energy: -2149.938181849527
dipole: 4.90299 -5.37312 -0.47014 -20.44701 20.30748 -0.13953 14.93455 -13.84180 1.09276
magnitude: 1.19775 au
magnitude: 3.04445 debye
