program: Orca
programVersion: 5.0.2
elementType: Cl Cl F O O O N C C C C C C C C C C C C C C C C C C C C C C H H H H H H H H H H H H H H H H H H
charge: 0
multiplicity: 1
keywords: wb97x-d3
keywords: def2-TZVPP
keywords: def2/J RIJCOSX
keywords: DEFGRID2
keywords: scfconv7
keywords: smallprint printgap noloewdin
keywords: NOSOSCF
formula: C22H18Cl2FNO3
InChI: InChI=1/C22H18Cl2FNO3/c1-22(2)15(11-19(23)24)20(22)21(27)29-18(12-26)13-8-9-16(25)17(10-13)28-14-6-4-3-5-7-14/h3-11,15,18,20H,1-2H3
47 atoms
Cl -4.680021 2.947499 1.49876
Cl -5.298246 4.691435 -0.713182
F  3.626446 -3.951153 -0.792647
O  1.240096 1.787164 -0.707421
O  0.04415 0.961566 0.993244
O  2.884227 -3.095988 1.686327
N  4.274316 3.06455 -0.94988
C  -2.099028 0.638094 -1.283053
C  -2.446561 1.798235 -0.39669
C  -1.05921 1.705905 -0.996586
C  -2.626677 0.590905 -2.697457
C  -1.992461 -0.728876 -0.650465
C  -3.340531 2.878212 -0.835706
C  0.088552 1.436551 -0.108254
C  -4.306148 3.425114 -0.107547
C  2.439169 1.46117 -0.009396
C  2.804229 0.012503 -0.214268
C  3.460659 2.362805 -0.545087
C  2.670455 -0.887959 0.834346
C  3.209043 -0.437943 -1.464474
C  2.955028 -2.229438 0.644873
C  3.487227 -1.779168 -1.666431
C  3.358885 -2.661354 -0.613017
C  1.90677 -4.054581 1.68598
C  2.141048 -5.174611 2.471167
C  0.718894 -3.919832 0.982575
C  1.177898 -6.165691 2.548386
C  -0.234345 -4.925129 1.067056
C  -0.012826 -6.049819 1.844699
H  -2.491992 1.559182 0.65964
H  -0.836575 2.366222 -1.827193
H  -2.613034 1.55962 -3.195155
H  -2.025834 -0.090187 -3.301389
H  -3.655102 0.227181 -2.708835
H  -1.27199 -1.347747 -1.189828
H  -1.694854 -0.69629 0.394688
H  -2.961037 -1.228303 -0.704383
H  -3.209788 3.275693 -1.834376
H  2.333134 1.672596 1.059168
H  2.338693 -0.558944 1.810574
H  3.321705 0.255772 -2.287779
H  3.813127 -2.143291 -2.631309
H  3.073368 -5.261402 3.012717
H  0.522512 -3.040011 0.382971
H  1.363756 -7.038578 3.160065
H  -1.161142 -4.819137 0.51901
H  -0.760846 -6.828305 1.905183
totalener: -2149.91397294 hartree
nucrepener: 2909.96359274 hartree
electener: -5059.87756567 hartree
oneelecener: -8732.76593485 hartree
twoeener: 3672.88836918 hartree
kineticenergy: 2143.53128837 hartree
xcener: -159.166652206950 hartree
chargesum: -0.0000000
charge: -0.037051 -0.042228 -0.182974 -0.255434 -0.379394 -0.298254 0.001600 0.077698 0.044600 -0.093384 -0.242122 -0.267637 -0.205950 0.355798 0.050406 0.315164 -0.031605 -0.260287 -0.106232 -0.133267 0.090824 -0.164779 0.269473 0.236023 -0.185637 -0.113571 -0.101677 -0.147293 -0.131065 0.089802 0.082905 0.074120 0.093723 0.100992 0.085479 0.106160 0.095496 0.098151 0.122209 0.121763 0.127132 0.129906 0.123899 0.115221 0.125098 0.121412 0.124786
qa: -0.0371 -0.0422 -0.1830 -0.2554 -0.3794 -0.2983 0.0016 0.0777 0.0446 -0.0934 -0.2421 -0.2676 -0.2059 0.3558 0.0504 0.3152 -0.0316 -0.2603 -0.1062 -0.1333 0.0908 -0.1648 0.2695 0.2360 -0.1856 -0.1136 -0.1017 -0.1473 -0.1311 0.0898 0.0829 0.0741 0.0937 0.1010 0.0855 0.1062 0.0955 0.0982 0.1222 0.1218 0.1271 0.1299 0.1239 0.1152 0.1251 0.1214 0.1248
va: 1.2904 1.2628 1.1191 2.1375 2.1228 2.1077 3.1164 3.7511 3.8331 3.8782 3.9075 3.9136 3.9174 4.2365 4.2541 3.8355 3.6514 4.0247 3.9641 3.9811 3.8927 3.9438 4.0482 3.8064 4.0179 3.8956 3.9633 3.9886 3.9546 1.0479 1.0354 1.0105 1.0044 1.0026 0.9995 1.0178 1.0034 1.0300 1.0166 1.0285 1.0137 1.0070 1.0145 1.0101 0.9988 1.0019 1.0001
dispcorr: -0.024603221 hartree
energy: -2149.938576156839
dipole: 5.07511 -6.02351 -0.94840 -25.44866 24.38884 -1.05982 -7.57704 6.87477 -0.70227
magnitude: 1.58615 au
magnitude: 4.03167 debye
