program: Orca
programVersion: 5.0.2
elementType: Cl Cl F O O O N C C C C C C C C C C C C C C C C C C C C C C H H H H H H H H H H H H H H H H H H
charge: 0
multiplicity: 1
keywords: wb97x-d3
keywords: def2-TZVPP
keywords: def2/J RIJCOSX
keywords: DEFGRID2
keywords: scfconv7
keywords: smallprint printgap noloewdin
keywords: NOSOSCF
formula: C22H18Cl2FNO3
InChI: InChI=1/C22H18Cl2FNO3/c1-22(2)15(11-19(23)24)20(22)21(27)29-18(12-26)13-8-9-16(25)17(10-13)28-14-6-4-3-5-7-14/h3-11,15,18,20H,1-2H3
47 atoms
Cl -4.087766 4.8428 1.208667
Cl -3.906755 6.496098 -1.147589
F  2.493873 -4.511743 -1.316389
O  0.797756 1.403481 -0.476673
O  -0.794909 0.879331 1.010209
O  1.058999 -3.990044 0.952352
N  3.949781 2.237901 0.090988
C  -2.721502 1.426317 -1.400555
C  -2.642885 2.666526 -0.562162
C  -1.364816 1.994116 -1.034912
C  -3.099954 1.525633 -2.860103
C  -3.240101 0.16762 -0.748271
C  -2.969905 3.996483 -1.091213
C  -0.475377 1.361487 -0.041707
C  -3.570279 4.973978 -0.423071
C  1.78978 0.789083 0.339629
C  2.024775 -0.636444 -0.090926
C  2.99496 1.607975 0.19299
C  1.477881 -1.67492 0.652703
C  2.739296 -0.918262 -1.2483
C  1.639683 -2.989077 0.24598
C  2.90352 -2.228507 -1.665288
C  2.347978 -3.249702 -0.922253
C  1.849679 -4.943018 1.537994
C  3.18571 -4.73341 1.846929
C  1.230985 -6.144563 1.852631
C  3.903465 -5.747963 2.464775
C  1.959519 -7.143987 2.474439
C  3.300426 -6.954741 2.779218
H  -2.864164 2.514592 0.488156
H  -0.838744 2.483659 -1.84658
H  -2.765152 0.636101 -3.395243
H  -4.183157 1.59351 -2.970309
H  -2.661416 2.386488 -3.363311
H  -2.80456 -0.717968 -1.21396
H  -3.034371 0.120867 0.317479
H  -4.321498 0.112944 -0.882286
H  -2.69634 4.217064 -2.115436
H  1.491045 0.817192 1.391715
H  0.908098 -1.473924 1.551332
H  3.18007 -0.118781 -1.829837
H  3.456164 -2.462526 -2.565058
H  3.671861 -3.792975 1.621123
H  0.187422 -6.288058 1.605936
H  4.946124 -5.584542 2.703029
H  1.475323 -8.081021 2.715328
H  3.867999 -7.73998 3.259245
totalener: -2149.91433836 hartree
nucrepener: 2831.25525068 hartree
electener: -4981.16958905 hartree
oneelecener: -8575.55768459 hartree
twoeener: 3594.38809554 hartree
kineticenergy: 2143.52067381 hartree
xcener: -159.164881178997 hartree
chargesum: -0.0000000
charge: -0.037457 -0.042951 -0.182789 -0.259368 -0.383284 -0.296662 -0.000962 0.067153 0.043016 -0.100448 -0.247392 -0.245827 -0.198749 0.371740 0.049201 0.311730 -0.028319 -0.255423 -0.108488 -0.132096 0.081210 -0.160012 0.262016 0.261288 -0.135887 -0.204651 -0.138652 -0.095257 -0.140019 0.087545 0.080475 0.094993 0.100325 0.074509 0.088057 0.103170 0.090689 0.096132 0.121647 0.127235 0.126166 0.130871 0.125384 0.123422 0.126324 0.124977 0.125416
qa: -0.0375 -0.0430 -0.1828 -0.2594 -0.3833 -0.2967 -0.0010 0.0672 0.0430 -0.1004 -0.2474 -0.2458 -0.1987 0.3717 0.0492 0.3117 -0.0283 -0.2554 -0.1085 -0.1321 0.0812 -0.1600 0.2620 0.2613 -0.1359 -0.2047 -0.1387 -0.0953 -0.1400 0.0875 0.0805 0.0950 0.1003 0.0745 0.0881 0.1032 0.0907 0.0961 0.1216 0.1272 0.1262 0.1309 0.1254 0.1234 0.1263 0.1250 0.1254
va: 1.2901 1.2619 1.1188 2.1285 2.1196 2.1074 3.1134 3.7536 3.8365 3.8699 3.9112 3.9141 3.9181 4.2186 4.2556 3.8262 3.7013 4.0260 3.9524 3.9913 3.8877 3.9433 4.0353 3.7779 3.9098 4.0307 3.9878 3.9554 3.9603 1.0477 1.0368 1.0041 1.0026 1.0102 1.0023 1.0207 1.0011 1.0321 1.0220 1.0276 1.0143 1.0069 1.0096 1.0142 1.0007 0.9987 1.0001
dispcorr: -0.022992412 hartree
energy: -2149.937330774879
dipole: 5.88488 -6.47302 -0.58814 -30.37748 29.31402 -1.06345 -3.86320 3.09025 -0.77295
magnitude: 1.44024 au
magnitude: 3.66080 debye
