program: Orca
programVersion: 5.0.2
elementType: Cl Cl F O O O N C C C C C C C C C C C C C C C C C C C C C C H H H H H H H H H H H H H H H H H H
charge: 0
multiplicity: 1
keywords: wb97x-d3
keywords: def2-TZVPP
keywords: def2/J RIJCOSX
keywords: DEFGRID2
keywords: scfconv7
keywords: smallprint printgap noloewdin
keywords: NOSOSCF
formula: C22H18Cl2FNO3
InChI: InChI=1/C22H18Cl2FNO3/c1-22(2)15(11-19(23)24)20(22)21(27)29-18(12-26)13-8-9-16(25)17(10-13)28-14-6-4-3-5-7-14/h3-11,15,18,20H,1-2H3
47 atoms
Cl -3.364743 5.708332 0.043665
Cl -5.232793 4.834368 -1.974176
F  3.93618 -3.147459 2.389646
O  0.475433 0.625461 -1.20339
O  0.629796 2.268878 0.309892
O  3.085229 -4.029504 -0.044098
N  2.455713 -0.061281 -3.761243
C  -2.378499 1.567761 0.825903
C  -2.285068 2.770735 -0.064632
C  -1.519407 1.512586 -0.42384
C  -3.630874 0.72365 0.800297
C  -1.752038 1.651005 2.19616
C  -3.400881 3.198223 -0.921404
C  -0.044489 1.540213 -0.366477
C  -3.922879 4.418603 -0.943143
C  1.898162 0.555959 -1.285241
C  2.461118 -0.447861 -0.311138
C  2.199138 0.207241 -2.674662
C  2.48417 -1.804322 -0.616814
C  2.930574 -0.013936 0.921817
C  2.987889 -2.718282 0.29072
C  3.42854 -0.92379 1.841847
C  3.455253 -2.264418 1.51983
C  2.209337 -4.930151 0.494939
C  1.081188 -4.565511 1.215376
C  2.491184 -6.268982 0.255054
C  0.23949 -5.556746 1.702269
C  1.638502 -7.243228 0.742719
C  0.509182 -6.895184 1.471872
H  -1.668892 3.57203 0.327844
H  -1.921911 0.912813 -1.232517
H  -4.04701 0.602925 -0.199102
H  -3.42305 -0.274183 1.188837
H  -4.40342 1.171827 1.426765
H  -0.895152 2.318054 2.235548
H  -2.492482 2.017555 2.908801
H  -1.428455 0.665017 2.534558
H  -3.844279 2.471199 -1.590624
H  2.335571 1.539266 -1.088429
H  2.137196 -2.169864 -1.576077
H  2.908201 1.038031 1.171348
H  3.804855 -0.596332 2.801506
H  0.843427 -3.525279 1.395639
H  3.373777 -6.535105 -0.311349
H  -0.638088 -5.270118 2.266552
H  1.861546 -8.284762 0.552538
H  -0.152367 -7.660293 1.854006
totalener: -2149.91450577 hartree
nucrepener: 2848.60679230 hartree
electener: -4998.52129807 hartree
oneelecener: -8610.06779498 hartree
twoeener: 3611.54649691 hartree
kineticenergy: 2143.51757173 hartree
xcener: -159.164542567656 hartree
chargesum: -0.0000000
charge: -0.037923 -0.040303 -0.181773 -0.258044 -0.390803 -0.292863 0.000585 0.073863 0.034951 -0.115742 -0.233164 -0.250869 -0.198880 0.373540 0.046131 0.321910 -0.045744 -0.257598 -0.124689 -0.087886 0.082889 -0.176906 0.255749 0.284196 -0.150082 -0.215501 -0.136046 -0.086320 -0.149044 0.092679 0.084069 0.073244 0.094455 0.099865 0.102290 0.091643 0.087250 0.102314 0.125482 0.124844 0.133312 0.129687 0.116432 0.125284 0.123914 0.124758 0.124842
qa: -0.0379 -0.0403 -0.1818 -0.2580 -0.3908 -0.2929 0.0006 0.0739 0.0350 -0.1157 -0.2332 -0.2509 -0.1989 0.3735 0.0461 0.3219 -0.0457 -0.2576 -0.1247 -0.0879 0.0829 -0.1769 0.2557 0.2842 -0.1501 -0.2155 -0.1360 -0.0863 -0.1490 0.0927 0.0841 0.0732 0.0945 0.0999 0.1023 0.0916 0.0872 0.1023 0.1255 0.1248 0.1333 0.1297 0.1164 0.1253 0.1239 0.1248 0.1248
va: 1.2894 1.2656 1.1220 2.1318 2.1095 2.1155 3.1114 3.7477 3.8217 3.9048 3.9074 3.9123 3.9028 4.2068 4.2493 3.8105 3.7180 4.0205 4.0379 3.9017 3.8956 3.9571 4.0561 3.7794 3.9132 4.0323 3.9881 3.9485 3.9704 1.0454 1.0364 1.0098 1.0046 1.0035 1.0205 1.0022 1.0019 1.0263 1.0186 1.0257 1.0187 1.0074 1.0156 1.0146 1.0010 0.9986 1.0005
dispcorr: -0.023231583 hartree
energy: -2149.937737349355
dipole: 0.88953 -1.72482 -0.83529 -27.24586 26.88061 -0.36524 13.97319 -12.59073 1.38246
magnitude: 1.65600 au
magnitude: 4.20921 debye
